3-chloro-2,2,3-trimethylpentane
- Formula: C8H17Cl
- Molecular weight: 148.674
- IUPAC Standard InChIKey: YUBAGQLZRJFSIZ-UHFFFAOYSA-N
- CAS Registry Number: 918-09-2
- Chemical structure:
View 3d structure (requires JavaScript / HTML 5) - Permanent link for this species. Use this link for bookmarking this species for future reference.

Phase change data

Data compiled by: Thermodynamics Research Center, NIST Boulder Laboratories, Chris Muzny director
Quantity | Value | Units | Method | Reference | Comment |
---|---|---|---|---|---|
Tfus | 255.25 | K | N/A | Howard, Mears, et al., 1947 | Uncertainty assigned by TRC = 0.2 K |

References

Howard, Mears, et al., 1947
Howard, F.L.; Mears, T.W.; Fookson, A.; Pomerantz, P.; Brooks, D.B.,
Preparation and physical properties of several aliphatic hydrocarbons and intermediates,
J. Res. Natl. Bur. Stand. (U. S.), 1947, 38, 365. [all data]