2-chloro-2,3,3-trimethylbutane
- Formula: C7H15Cl
- Molecular weight: 134.647
- IUPAC Standard InChIKey: IFMWWVGVDOTBNN-UHFFFAOYSA-N
- CAS Registry Number: 918-07-0
- Chemical structure:
View 3d structure (requires JavaScript / HTML 5) - Other names: Butane, 2-chloro-2,3,3-trimethyl-

Condensed phase thermochemistry data

Data compiled by: Hussein Y. Afeefy, Joel F. Liebman, and Stephen E. Stein
Quantity | Value | Units | Method | Reference | Comment |
---|---|---|---|---|---|
ΔfH°liquid | -290. ± 3. | kJ/mol | Cm | Arnett and Pienta, 1980 | Hydrochlorination |

Reaction thermochemistry data

Data compiled by: Hussein Y. Afeefy, Joel F. Liebman, and Stephen E. Stein
Individual Reactions
By formula: C7H14 + HCl = C7H15Cl
Quantity | Value | Units | Method | Reference | Comment |
---|---|---|---|---|---|
ΔrH° | -60.0 ± 1.9 | kJ/mol | Cm | Arnett and Pienta, 1980 | liquid phase; solvent: Methylene chloride; Hydrochlorination |

References

Arnett and Pienta, 1980
Arnett, E.M.; Pienta, N.J.,
Stabilities of carbonium ions in solution. 12. Heats of formation of alkyl chlorides as an entree to heats of solvation of aliphatic carbonium ions,
J. Am. Chem. Soc., 1980, 102, 3329-3334. [all data]