Methanesulfonamide, N,N-dimethyl-
- Formula: C3H9NO2S
- Molecular weight: 123.174
- IUPAC Standard InChIKey: WCFDSGHAIGTEKL-UHFFFAOYSA-N
- CAS Registry Number: 918-05-8
- Chemical structure:
View 3d structure (requires JavaScript / HTML 5) - Other names: N,N-Dimethylmethanesulfonamide; N,N-dimethylmethanesulphonamide

Phase change data

Data compiled by: Robert L. Brown and Stephen E. Stein
Reduced pressure boiling point
Tboil (K) | Pressure (bar) | Reference |
---|---|---|
392. to 393. | 0.023 | Frinton Laboratories Inc., 1986 |

References

Frinton Laboratories Inc., 1986
Frinton Laboratories Inc.,
Catalog Number 11, Frinton Laboratories Inc., Vineland, NJ, 1986, 99. [all data]