dimethylamine-d

Phase change data

Data compiled by: Thermodynamics Research Center, NIST Boulder Laboratories, Chris Muzny director

Quantity Value Units Method Reference Comment
Tboil280.9KN/ARoberts, Emeleus, et al., 1939Uncertainty assigned by TRC = 0.2 K
Tboil280.85KN/ARoberts, Emeleus, et al., 1939Uncertainty assigned by TRC = 0.2 K
Quantity Value Units Method Reference Comment
Tfus182.05KN/ARoberts, Emeleus, et al., 1939Uncertainty assigned by TRC = 0.3 K

In addition to the Thermodynamics Research Center (TRC) data available from this site, much more physical and chemical property data is available from the following TRC products:

References

Roberts, Emeleus, et al., 1939
Roberts, E.R.; Emeleus, H.J.; Briscoe, H.V.A., Preparation and Prop. of Ethyldideuteramine and Dimethyldeuteramine, J. Chem. Soc., 1939, 1939, 41. [all data]