iodomethylmagnesium

Reaction thermochemistry data

Data compiled by: José A. Martinho Simões

Individual Reactions

magnesium (cr) + Methane, iodo- (solution) = CH3IMg (solution)

By formula: Mg (cr) + CH3I (solution) = CH3IMg (solution)

Quantity Value Units Method Reference Comment
Δr-273.6 ± 0.8kJ/molRSCCarson and Skinner, 1950solvent: Diethyl ether; It was assumed that MeI(l) has a negligible solution enthalpy in ether

References

Carson and Skinner, 1950
Carson, A.S.; Skinner, H.A., Nature, 1950, 165, 484. [all data]