Sodium cyanate
- Formula: CNO·Na
- Molecular weight: 65.0066
- CAS Registry Number: 917-61-3

Reaction thermochemistry data

Data compiled by: Hussein Y. Afeefy, Joel F. Liebman, and Stephen E. Stein
Individual Reactions
By formula: 2HNaO + CBrN = BrNa + H2O + CNO.Na
Quantity | Value | Units | Method | Reference | Comment |
---|---|---|---|---|---|
ΔrH° | -56.06 ± 0.17 | kcal/mol | Cm | Lord and Woolf, 1954 | solid phase; Heat of hydrolysis |
By formula: 2HNaO + CIN = INa + H2O + CNO.Na
Quantity | Value | Units | Method | Reference | Comment |
---|---|---|---|---|---|
ΔrH° | -46.35 ± 0.08 | kcal/mol | Cm | Lord and Woolf, 1954 | solid phase; Heat of hydrolysis |
By formula: 2HNaO + CClN = ClNa + H2O + CNO.Na
Quantity | Value | Units | Method | Reference | Comment |
---|---|---|---|---|---|
ΔrH° | -66.3 ± 0.1 | kcal/mol | Cm | Lord and Woolf, 1954 | solid phase; Heat of Hydrolysis |

References

Lord and Woolf, 1954
Lord, G.; Woolf, A.A.,
The cyanogen halides. Part III. Their heats of formation and free energies,
J. Chem. Soc., 1954, 2546-2551. [all data]