C14H10CrF6
- Formula: C14H10CrF6
- Molecular weight: 344.2157
- CAS Registry Number: 91711-71-6

Gas phase ion energetics data

Data compiled by: John E. Bartmess
De-protonation reactions
C14H9CrF6- + = C14H10CrF6
By formula: C14H9CrF6- + H+ = C14H10CrF6
Quantity | Value | Units | Method | Reference | Comment |
---|---|---|---|---|---|
ΔrH° | 1487. ± 11. | kJ/mol | G+TS | Kahn, Hehre, et al., 1984 | gas phase; value altered from reference due to change in acidity scale |
Quantity | Value | Units | Method | Reference | Comment |
ΔrG° | 1457. ± 10. | kJ/mol | IMRE | Kahn, Hehre, et al., 1984 | gas phase; value altered from reference due to change in acidity scale |

Reaction thermochemistry data

Data compiled by: John E. Bartmess
Individual Reactions
C14H9CrF6- + = C14H10CrF6
By formula: C14H9CrF6- + H+ = C14H10CrF6
Quantity | Value | Units | Method | Reference | Comment |
---|---|---|---|---|---|
ΔrH° | 355.5 ± 2.6 | kcal/mol | G+TS | Kahn, Hehre, et al., 1984 | gas phase; value altered from reference due to change in acidity scale |
Quantity | Value | Units | Method | Reference | Comment |
ΔrG° | 348.3 ± 2.5 | kcal/mol | IMRE | Kahn, Hehre, et al., 1984 | gas phase; value altered from reference due to change in acidity scale |

References

Kahn, Hehre, et al., 1984
Kahn, S.D.; Hehre, W.J.; Bartmess, J.E.; Caldwell, G.,
Effect of Metal Complexation on the Gas-phase Acidities of Alkylbenzenes,
Organomet., 1984, 3, 11, 1740, https://doi.org/10.1021/om00089a024
. [all data]