C13H8CrF6
- Formula: C13H8CrF6
- Molecular weight: 330.1891
- CAS Registry Number: 91711-70-5

Gas phase ion energetics data

Data compiled by: John E. Bartmess
De-protonation reactions
C13H7CrF6- + = C13H8CrF6
By formula: C13H7CrF6- + H+ = C13H8CrF6
Quantity | Value | Units | Method | Reference | Comment |
---|---|---|---|---|---|
ΔrH° | 1483. ± 10. | kJ/mol | G+TS | Kahn, Hehre, et al., 1984 | gas phase |
Quantity | Value | Units | Method | Reference | Comment |
ΔrG° | 1453. ± 10. | kJ/mol | IMRE | Kahn, Hehre, et al., 1984 | gas phase |

References

Kahn, Hehre, et al., 1984
Kahn, S.D.; Hehre, W.J.; Bartmess, J.E.; Caldwell, G.,
Effect of Metal Complexation on the Gas-phase Acidities of Alkylbenzenes,
Organomet., 1984, 3, 11, 1740, https://doi.org/10.1021/om00089a024
. [all data]