3-hexanol, 4-ethyl-2,2,3,4-tetramethyl-

Phase change data

Data compiled by: Thermodynamics Research Center, NIST Boulder Laboratories, Chris Muzny director

Quantity Value Units Method Reference Comment
Tboil511.65KN/ANazarov, 1937Uncertainty assigned by TRC = 4. K

In addition to the Thermodynamics Research Center (TRC) data available from this site, much more physical and chemical property data is available from the following TRC products:

References

Nazarov, 1937
Nazarov, I.N., Synthesis of Tertiary Alcohols of the General FOrmulas R3CC(OH)MeCHR2 and R3CC(OH)MeCR3. Action of Methylmagnesium Bromide on Branched Ketones, Chem. Ber., 1937, 70, 599-605. [all data]