Quinoline, 2-methyl-
- Formula: C10H9N
- Molecular weight: 143.1852
- IUPAC Standard InChIKey: SMUQFGGVLNAIOZ-UHFFFAOYSA-N
- CAS Registry Number: 91-63-4
- Chemical structure:
View 3d structure (requires JavaScript / HTML 5) - Other names: Khinaldin; Quinaldine; 2-Methylquinoline; Chinaldine; 2-Methylchinolin; α-Methylquinoline

Gas phase thermochemistry data

Data compiled by: Hussein Y. Afeefy, Joel F. Liebman, and Stephen E. Stein
Quantity | Value | Units | Method | Reference | Comment |
---|---|---|---|---|---|
ΔfH°gas | 159.1 ± 3.1 | kJ/mol | Ccb | Ribeiro da Silva, Matos, et al., 1995 |

Condensed phase thermochemistry data

Data compiled by: Hussein Y. Afeefy, Joel F. Liebman, and Stephen E. Stein
Quantity | Value | Units | Method | Reference | Comment |
---|---|---|---|---|---|
ΔfH°liquid | 93.0 ± 2.5 | kJ/mol | Ccb | Ribeiro da Silva, Matos, et al., 1995 | |
Quantity | Value | Units | Method | Reference | Comment |
ΔcH°liquid | -5314.3 ± 2.1 | kJ/mol | Ccb | Ribeiro da Silva, Matos, et al., 1995 |

Phase change data

Data compiled as indicated in comments:
BS - Robert L. Brown and Stephen E. Stein
TRC - Thermodynamics Research Center, NIST Boulder Laboratories, Chris Muzny director
AC - William E. Acree, Jr., James S. Chickos
ALS - Hussein Y. Afeefy, Joel F. Liebman, and Stephen E. Stein
DRB - Donald R. Burgess, Jr.
Quantity | Value | Units | Method | Reference | Comment |
---|---|---|---|---|---|
Tboil | 520. ± 2. | K | AVG | N/A | Average of 12 values; Individual data points |
Quantity | Value | Units | Method | Reference | Comment |
Tfus | 270.3 | K | N/A | Zegalska, 1968 | Uncertainty assigned by TRC = 0.2 K; TRC |
Quantity | Value | Units | Method | Reference | Comment |
ΔvapH° | 62.6 ± 0.1 | kJ/mol | IP,EB | Chirico and Steele, 2005 | Based on data from 319. to 553. K.; AC |
ΔvapH° | 66.1 ± 1.9 | kJ/mol | C | Ribeiro da Silva, Matos, et al., 1995 | ALS |
ΔvapH° | 66.1 | kJ/mol | N/A | Ribeiro da Silva, Matos, et al., 1995 | DRB |
ΔvapH° | 66.1 ± 1.9 | kJ/mol | C | Ribeiro da Silva, 1995 | AC |
Enthalpy of vaporization
ΔvapH (kJ/mol) | Temperature (K) | Method | Reference | Comment |
---|---|---|---|---|
61.0 ± 0.1 | 320. | IP,EB | Chirico and Steele, 2005 | Based on data from 319. to 553. K.; AC |
58.2 ± 0.1 | 360. | IP,EB | Chirico and Steele, 2005 | Based on data from 319. to 553. K.; AC |
55.6 ± 0.1 | 400. | IP,EB | Chirico and Steele, 2005 | Based on data from 319. to 553. K.; AC |
53.0 ± 0.1 | 440. | IP,EB | Chirico and Steele, 2005 | Based on data from 319. to 553. K.; AC |
50.4 ± 0.1 | 480. | IP,EB | Chirico and Steele, 2005 | Based on data from 319. to 553. K.; AC |
47.7 ± 0.2 | 520. | IP,EB | Chirico and Steele, 2005 | Based on data from 319. to 553. K.; AC |
54.7 | 548. | A,EB | Stephenson and Malanowski, 1987 | Based on data from 443. to 521. K. See also Malanowski, 1961 and Malanowski, 1961, 2.; AC |
61.2 | 297. | GS | Van de Rostyne and Prausnitz, 1980 | Based on data from 281. to 313. K.; AC |
Antoine Equation Parameters
log10(P) = A − (B / (T + C))
P = vapor pressure (bar)
T = temperature (K)
View plot Requires a JavaScript / HTML 5 canvas capable browser.
Temperature (K) | A | B | C | Reference | Comment |
---|---|---|---|---|---|
451.5 to 521.01 | 4.16054 | 1741.613 | -101.681 | Malanowski, 1961, 3 | Coefficents calculated by NIST from author's data. |
348.5 to 519.7 | 4.63788 | 2026.41 | -80.159 | Stull, 1947 | Coefficents calculated by NIST from author's data. |
Enthalpy of fusion
ΔfusH (kJ/mol) | Temperature (K) | Method | Reference | Comment |
---|---|---|---|---|
12.52 | 270.5 | AC,DSC | Chirico and Steele, 2005 | AC |

Kovats' RI, non-polar column, isothermal

Column type | Active phase | Temperature (C) | I | Reference | Comment |
---|---|---|---|---|---|
Capillary | OV-101 | 140. | 1294. | Dmitrikov and Nabivach, 1995 | He |
Capillary | OV-101 | 160. | 1308. | Dmitrikov and Nabivach, 1995 | He |
Capillary | OV-101 | 140. | 1294. | Berlizov, Nabivach, et al., 1987 | N2; Column length: 50. m; Column diameter: 0.22 mm |
Capillary | OV-101 | 160. | 1308. | Berlizov, Nabivach, et al., 1987 | N2; Column length: 50. m; Column diameter: 0.22 mm |
Capillary | OV-101 | 150. | 1293. | Morishita, Morimoto, et al., 1986 | N2; Column length: 20. m; Column diameter: 0.23 mm |

Kovats' RI, polar column, isothermal

Column type | Active phase | Temperature (C) | I | Reference | Comment |
---|---|---|---|---|---|
Capillary | PEG-20M | 140. | 1924. | Dmitrikov and Nabivach, 1995 | He |
Capillary | PEG-20M | 160. | 1946. | Dmitrikov and Nabivach, 1995 | He |
Capillary | PEG-20M | 140. | 1924. | Berlizov, Nabivach, et al., 1987 | N2; Column length: 30. m; Column diameter: 0.25 mm |
Capillary | PEG-20M | 160. | 1946. | Berlizov, Nabivach, et al., 1987 | N2; Column length: 30. m; Column diameter: 0.25 mm |
Capillary | PEG-20M | 140. | 1924. | Buryan, Macák, et al., 1987 | N2; Column length: 30. m; Column diameter: 0.25 mm |
Capillary | PEG-20M | 160. | 1946. | Buryan, Macák, et al., 1987 | N2; Column length: 30. m; Column diameter: 0.25 mm |
Capillary | PEG-20M | 150. | 1940. | Morishita, Morimoto, et al., 1986 | N2; Column length: 20. m; Column diameter: 0.23 mm |

Van Den Dool and Kratz RI, non-polar column, temperature ramp

Column type | Active phase | I | Reference | Comment |
---|---|---|---|---|
Capillary | OV-1 | 1277.5 | Gautzsch and Zinn, 1996 | 8. K/min; Tstart: 35. C; Tend: 300. C |
Capillary | DB-5 | 1312. | Rostad and Pereira, 1986 | 30. m/0.26 mm/0.25 μm, He, 50. C @ 4. min, 6. K/min, 300. C @ 20. min |

Normal alkane RI, non-polar column, temperature ramp

Column type | Active phase | I | Reference | Comment |
---|---|---|---|---|
Capillary | SE-30 | 1287.2 | Bur'yan and Nabivach, 1992 | 1.7 K/min; Tstart: 82. C; Tend: 177. C |
Capillary | SE-30 | 1287.2 | Bur'yan and Nabivach, 1992 | 1.7 K/min; Tstart: 82. C; Tend: 177. C |

Normal alkane RI, non-polar column, custom temperature program

Column type | Active phase | I | Reference | Comment |
---|---|---|---|---|
Capillary | Polydimethyl siloxane, unknown content of Ph-groups | 1311. | Geldon, 1989 | Program: not specified |
Capillary | Polydimethyl siloxane, unknown content of Ph-groups | 1313. | Geldon, 1989 | Program: not specified |

Normal alkane RI, polar column, custom temperature program

Column type | Active phase | I | Reference | Comment |
---|---|---|---|---|
Capillary | SOLGel-Wax | 1969. | Shu and Shen, 2008 | 30. m/0.53 mm/0.50 μm, Helium; Program: 40 0C 7 0C/min -> 180 0C 10 0C/min -> 240 0C (10 min) |
Capillary | SOLGel-Wax | 1971. | Shu and Shen, 2008 | 30. m/0.53 mm/0.50 μm, Helium; Program: not specified |
Capillary | DB-Wax | 1970. | Peng, Yang, et al., 1991 | Program: not specified |

Lee's RI, non-polar column, temperature ramp

Column type | Active phase | I | Reference | Comment |
---|---|---|---|---|
Capillary | OV-101 | 223.47 | Blanco, Blanco, et al., 1989 | H2, 4. K/min; Column length: 25. m; Column diameter: 0.22 mm; Tstart: 50. C; Tend: 300. C |
Capillary | DB-5 | 223.94 | Rostad and Pereira, 1986 | 30. m/0.26 mm/0.25 μm, He, 50. C @ 4. min, 6. K/min, 300. C @ 20. min |
Capillary | SE-52 | 224.13 | Vassilaros, Kong, et al., 1982 | 20. m/0.30 mm/0.25 μm, H2, 40. C @ 2. min, 4. K/min; Tend: 265. C |

References

Ribeiro da Silva, Matos, et al., 1995
Ribeiro da Silva, M.A.V.; Matos, M.A.R.; Amaral, L.M.P.F.,
Thermochemical study of 2-,4-,6-, and 8-methylquinoline,
J. Chem. Thermodyn., 1995, 27, 565-574. [all data]
Zegalska, 1968
Zegalska, B.,
Liquid-Solid Equilibria in Binary Systems Formed by Quinoline,
Bull. Acad. Pol. Sci., Ser. Sci. Chim., 1968, 16, 335-41. [all data]
Chirico and Steele, 2005
Chirico, R.D.; Steele, W.V.,
Thermodynamic Properties of 2-Methylquinoline and 8-Methylquinoline,
J. Chem. Eng. Data, 2005, 50, 2, 697-708, https://doi.org/10.1021/je049595u
. [all data]
Ribeiro da Silva, 1995
Ribeiro da Silva, M.,
Thermochemical study of 2-, 4-, 6-, and 8-methylquinoline,
The Journal of Chemical Thermodynamics, 1995, 27, 6, 565-574, https://doi.org/10.1006/jcht.1995.0058
. [all data]
Stephenson and Malanowski, 1987
Stephenson, Richard M.; Malanowski, Stanislaw,
Handbook of the Thermodynamics of Organic Compounds, 1987, https://doi.org/10.1007/978-94-009-3173-2
. [all data]
Malanowski, 1961
Malanowski, S.,
Bull. Acad. Pol. Sci. Ser. Sci. Chim., 1961, 9, 83. [all data]
Malanowski, 1961, 2
Malanowski, S.,
Bull. Acad. Pol. Sci. Ser. Sci. Chim., 1961, 9, 71. [all data]
Van de Rostyne and Prausnitz, 1980
Van de Rostyne, Catherine; Prausnitz, John M.,
Vapor pressures of some nitrogen-containing, coal-derived liquids,
J. Chem. Eng. Data, 1980, 25, 1, 1-3, https://doi.org/10.1021/je60084a008
. [all data]
Malanowski, 1961, 3
Malanowski, S.,
Vapour Pressures and Boiling Temperatures of Some Quinoline Bases,
Bull. Acad. Pol. Sci. Ser. Sci. Chim., 1961, 9, 2, 71-76. [all data]
Stull, 1947
Stull, Daniel R.,
Vapor Pressure of Pure Substances. Organic and Inorganic Compounds,
Ind. Eng. Chem., 1947, 39, 4, 517-540, https://doi.org/10.1021/ie50448a022
. [all data]
Bol'shakov, et al., 1969
Bol'shakov, G.F., et al.,
Ultraviolet spectra of heteroorganic compounds, 1969, 192. [all data]
Dmitrikov and Nabivach, 1995
Dmitrikov, V.P.; Nabivach, V.M.,
Physico-chemical regularities of quinoline bases retention in gas chromatography,
Coke Chem. (Engl. Transl.), 1995, 8, 27-34. [all data]
Berlizov, Nabivach, et al., 1987
Berlizov, Yu.S.; Nabivach, V.M.; Mitrikov, V.P.,
Capillary gas chromatography of alkylquinolines,
Zh. Anal. Khim., 1987, 62, 6, 1119-1124. [all data]
Morishita, Morimoto, et al., 1986
Morishita, F.; Morimoto, S.; Kojima, T.,
Prediction of molecular structures of aza-arenes by retention indices and fluorescence spectra,
J. Hi. Res. Chromatogr. Chromatogr. Comm., 1986, 9, 11, 688-692, https://doi.org/10.1002/jhrc.1240091120
. [all data]
Buryan, Macák, et al., 1987
Buryan, P.; Macák, J.; Triska, J.; Vodicka, L.; Berlizov, Yu.S.; Dmitrikov, V.P.; Nabivach, V.M.,
Kováts retention indices of alkylquinolines on capillary columns,
J. Chromatogr., 1987, 391, 89-96, https://doi.org/10.1016/S0021-9673(01)94307-9
. [all data]
Gautzsch and Zinn, 1996
Gautzsch, R.; Zinn, P.,
Use of incremental models to estimate the retention indexes of aromatic compounds,
Chromatographia, 1996, 43, 3/4, 163-176, https://doi.org/10.1007/BF02292946
. [all data]
Rostad and Pereira, 1986
Rostad, C.E.; Pereira, W.E.,
Kovats and Lee retention indices determined by gas chromatography/mass spectrometry for organic compounds of environmental interest,
J. Hi. Res. Chromatogr. Chromatogr. Comm., 1986, 9, 6, 328-334, https://doi.org/10.1002/jhrc.1240090603
. [all data]
Bur'yan and Nabivach, 1992
Bur'yan, P.; Nabivach, V.M.,
Investigation of composition of higher heterocnitrogen bases of brown coal tar,
Coke Chem. (Engl. Transl.), 1992, 5, 29-33. [all data]
Geldon, 1989
Geldon, A.L.,
Ground Water Hydrology of the Central Raton Basin, Colorado and New Mexico, US Geological Survey, US Government Printing Office, 1989, 104. [all data]
Shu and Shen, 2008
Shu, N.; Shen, H.,
Aroma-impact compounds in Lysimachia foenum-graecum extracts,
Flavour Fragr. J., 2008, 24, 1, 1-6, https://doi.org/10.1002/ffj.1908
. [all data]
Peng, Yang, et al., 1991
Peng, C.T.; Yang, Z.C.; Ding, S.F.,
Prediction of rentention idexes. II. Structure-retention index relationship on polar columns,
J. Chromatogr., 1991, 586, 1, 85-112, https://doi.org/10.1016/0021-9673(91)80028-F
. [all data]
Blanco, Blanco, et al., 1989
Blanco, C.G.; Blanco, J.; Bermejo, J.; Guillen, M.D.,
Capillary gas chromatography of some polycyclic aromatic compounds on several stationary phases,
J. Chromatogr., 1989, 465, 3, 378-385, https://doi.org/10.1016/S0021-9673(01)92675-5
. [all data]
Vassilaros, Kong, et al., 1982
Vassilaros, D.L.; Kong, R.C.; Later, D.W.; Lee, M.L.,
Linear retention index system for polycyclic aromatic compounds. Critical evaluation and additional indices,
J. Chromatogr., 1982, 252, 1-20, https://doi.org/10.1016/S0021-9673(01)88394-1
. [all data]