1-pentene, 2-chloro-4,4-dimethyl-
- Formula: C7H13Cl
- Molecular weight: 132.631
- IUPAC Standard InChIKey: KBXPVLVDPCPFTI-UHFFFAOYSA-N
- CAS Registry Number: 91524-25-3
- Chemical structure:
View 3d structure (requires JavaScript / HTML 5) - Permanent link for this species. Use this link for bookmarking this species for future reference.

Phase change data

Data compiled by: Thermodynamics Research Center, NIST Boulder Laboratories, Chris Muzny director
Quantity | Value | Units | Method | Reference | Comment |
---|---|---|---|---|---|
Tboil | 397. | K | N/A | Schmerling, 1946 | Uncertainty assigned by TRC = 4. K |

References

Schmerling, 1946
Schmerling, L.,
Condensation of Saturated Halides with Unsaturated Compounds II. The Condensation of ALkyl Halides with Monohaloolefins,
J. Am. Chem. Soc., 1946, 68, 1650-4. [all data]