Benzoic acid, 2,4-dimethoxy-
- Formula: C9H10O4
- Molecular weight: 182.1733
- IUPAC Standard InChIKey: GPVDHNVGGIAOQT-UHFFFAOYSA-N
- CAS Registry Number: 91-52-1
- Chemical structure:
View 3d structure (requires JavaScript / HTML 5) - Other names: 2,4-Dimethoxybenzoic acid

Condensed phase thermochemistry data

Data compiled by: Hussein Y. Afeefy, Joel F. Liebman, and Stephen E. Stein
Quantity | Value | Units | Method | Reference | Comment |
---|---|---|---|---|---|
ΔfH°solid | -712.2 ± 1.4 | kJ/mol | Ccb | Colomina, Roux, et al., 1981 | |
Quantity | Value | Units | Method | Reference | Comment |
ΔcH°solid | -4258.6 ± 0.8 | kJ/mol | Ccb | Colomina, Roux, et al., 1981 | Corresponding ΔfHºsolid = -712.1 kJ/mol (simple calculation by NIST; no Washburn corrections) |

Phase change data

Data compiled as indicated in comments:
TRC - Thermodynamics Research Center, NIST Boulder Laboratories, Chris Muzny director
ALS - Hussein Y. Afeefy, Joel F. Liebman, and Stephen E. Stein
AC - William E. Acree, Jr., James S. Chickos
Quantity | Value | Units | Method | Reference | Comment |
---|---|---|---|---|---|
Tfus | 380.15 | K | N/A | Witschonke, 1954 | Uncertainty assigned by TRC = 0.3 K; TRC |
Tfus | 380.45 | K | N/A | Witschonke, 1954 | Uncertainty assigned by TRC = 0.2 K; TRC |
Quantity | Value | Units | Method | Reference | Comment |
ΔsubH° | 123.4 ± 0.4 | kJ/mol | V | Colomina, Jimenez, et al., 1985 | ALS |
ΔsubH° | 123.4 ± 0.4 | kJ/mol | ME | Colomina, Jiménez, et al., 1985 | Based on data from 346. to 367. K.; AC |
Enthalpy of sublimation
ΔsubH (kJ/mol) | Temperature (K) | Method | Reference | Comment |
---|---|---|---|---|
120.5 ± 0.4 | 357. | ME | Colomina, Jiménez, et al., 1985 | Based on data from 346. to 367. K.; AC |

Normal alkane RI, non-polar column, isothermal

Column type | Active phase | Temperature (C) | I | Reference | Comment |
---|---|---|---|---|---|
Packed | Apieson L | 140. | 1567. | Hedin, Minyard, et al., 1967 | Nitrogen, Chromosorb W HMDS (60-80 mesh); Column length: 1.8 m |

References

Colomina, Roux, et al., 1981
Colomina, M.; Roux, M.V.; Turrion, C.,
Thermochemical properties of benzoic acid derivatives. X. Enghalpies of combustion and formation of 2,3-, 2,4-, 2,6-, 3,4-, and 3,5-dimethoxybenzoic acids,
J. Chem. Thermodyn., 1981, 13, 1169-1173. [all data]
Witschonke, 1954
Witschonke, C.R.,
Freezing point and purity data for some organic compounds,
Anal. Chem., 1954, 26, 562-4. [all data]
Colomina, Jimenez, et al., 1985
Colomina, M.; Jimenez, P.; Roux, M.V.; Turrion, C.,
Thermochemical properties of benzoic acid derivatives. XII. Vapour pressures and enthalpies of sublimation and formation of five dimethoxybenzoic acids,
J. Chem. Thermodyn., 1985, 17, 1091-10. [all data]
Colomina, Jiménez, et al., 1985
Colomina, M.; Jiménez, P.; Roux, M.V.; Turrión, C.,
Thermochemical properties of benzoic acid derivatives XII. Vapour pressures and enthalpies of sublimation and formation of five dimethoxybenzoic acids,
The Journal of Chemical Thermodynamics, 1985, 17, 11, 1091-1096, https://doi.org/10.1016/0021-9614(85)90096-5
. [all data]
Hedin, Minyard, et al., 1967
Hedin, P.A.; Minyard, J.P.; Thompson, A.C.,
Chromatographic and spectral analysis of phenolic acids and related compounds,
J. Chromatogr., 1967, 30, 43-53, https://doi.org/10.1016/S0021-9673(00)84111-4
. [all data]