2-Methyl-5-cyanotetrazole
- Formula: C3H3N5
- Molecular weight: 109.0894
- IUPAC Standard InChIKey: YJHCYACRUYYBSU-UHFFFAOYSA-N
- CAS Registry Number: 91511-39-6
- Chemical structure:
View 3d structure (requires JavaScript / HTML 5) - Permanent link for this species. Use this link for bookmarking this species for future reference.

Condensed phase thermochemistry data

Data compiled by: Hussein Y. Afeefy, Joel F. Liebman, and Stephen E. Stein
Quantity | Value | Units | Method | Reference | Comment |
---|---|---|---|---|---|
ΔfH°solid | -401. | kJ/mol | Ccb | Handrick, 1956 | Naval Ordnance Test Station, Propellants and Explosives, Navord 7025 |
Quantity | Value | Units | Method | Reference | Comment |
ΔcH°solid | -2010. | kJ/mol | Ccb | Handrick, 1956 | Naval Ordnance Test Station, Propellants and Explosives, Navord 7025 |

References

Handrick, 1956
Handrick, G.R.,
Report of the study of pure explosive compounds. Part IV. Calculation of heat of combustion of organic compounds from structural features and calculation of power of high explosives, Rpt. C-58247 for the Office of the Chief of Ordnance, contract DA-19-020-ORD-47 by the Arthur D. Little, Inc., Cambridge, MA, 1956, 467-573. [all data]