Naphthalene
- Formula: C10H8
- Molecular weight: 128.1705
- IUPAC Standard InChIKey: UFWIBTONFRDIAS-UHFFFAOYSA-N
- CAS Registry Number: 91-20-3
- Chemical structure:
View 3d structure (requires JavaScript / HTML 5) - Isotopologues:
- Other names: Albocarbon; Dezodorator; Moth flakes; Naphthalin; Naphthaline; Naphthene; Tar camphor; White tar; Camphor tar; Moth balls; Naftalen; NCI-C52904; Mighty 150; Mighty RD1; Rcra waste number U165; UN 1334; UN 2304; NSC 37565

Gas phase thermochemistry data

Data compiled as indicated in comments:
DRB - Donald R. Burgess, Jr.
ALS - Hussein Y. Afeefy, Joel F. Liebman, and Stephen E. Stein
GT - Glushko Thermocenter, Russian Academy of Sciences, Moscow
Quantity | Value | Units | Method | Reference | Comment |
---|---|---|---|---|---|
ΔfH°gas | 150. ± 10. | kJ/mol | AVG | N/A | Average of 7 values; Individual data points |
Constant pressure heat capacity of gas
Cp,gas (J/mol*K) | Temperature (K) | Reference | Comment |
---|---|---|---|
36.18 | 50. | Thermodynamics Research Center, 1997 | p=1 bar. Selected values of S(T) and Cp(T) agree with those calculated by statistical thermodynamics method [ Dorofeeva O.V., 1986, Dorofeeva O.V., 1988] within 1.2 J/mol*K. Discrepancies with other calculations [ Barrow G.M., 1951, McClellan A.L., 1955, 79CHE/KUD, Lielmezs J., 1981] reach 2-3 J/mol*K.; GT |
47.50 | 100. | ||
63.89 | 150. | ||
84.99 | 200. | ||
120.52 | 273.15 | ||
133.02 | 298.15 | ||
133.94 | 300. | ||
181.16 | 400. | ||
220.70 | 500. | ||
252.37 | 600. | ||
277.77 | 700. | ||
298.43 | 800. | ||
315.50 | 900. | ||
329.77 | 1000. | ||
341.8 | 1100. | ||
352.0 | 1200. | ||
360.8 | 1300. | ||
368.2 | 1400. | ||
374.7 | 1500. |
Constant pressure heat capacity of gas
Cp,gas (J/mol*K) | Temperature (K) | Reference | Comment |
---|---|---|---|
201.6 ± 2.0 | 451.0 | Barrow G.M., 1951 | GT |
226.7 ± 2.3 | 522.7 |

Phase change data

Data compiled as indicated in comments:
BS - Robert L. Brown and Stephen E. Stein
TRC - Thermodynamics Research Center, NIST Boulder Laboratories, Chris Muzny director
AC - William E. Acree, Jr., James S. Chickos
DH - Eugene S. Domalski and Elizabeth D. Hearing
DRB - Donald R. Burgess, Jr.
ALS - Hussein Y. Afeefy, Joel F. Liebman, and Stephen E. Stein
Quantity | Value | Units | Method | Reference | Comment |
---|---|---|---|---|---|
Tboil | 490. ± 5. | K | AVG | N/A | Average of 10 out of 11 values; Individual data points |
Quantity | Value | Units | Method | Reference | Comment |
Tfus | 353.2 ± 0.7 | K | AVG | N/A | Average of 55 out of 57 values; Individual data points |
Quantity | Value | Units | Method | Reference | Comment |
Ttriple | 353.39 ± 0.09 | K | AVG | N/A | Average of 6 values; Individual data points |
Quantity | Value | Units | Method | Reference | Comment |
Tc | 748. ± 6. | K | AVG | N/A | Average of 13 out of 14 values; Individual data points |
Quantity | Value | Units | Method | Reference | Comment |
Pc | 41. ± 1. | bar | AVG | N/A | Average of 10 out of 11 values; Individual data points |
Quantity | Value | Units | Method | Reference | Comment |
Vc | 0.407 | l/mol | N/A | Tsonopoulos and Ambrose, 1995 | |
Vc | 0.409 | l/mol | N/A | Cheng, 1963 | Uncertainty assigned by TRC = 0.06 l/mol; TRC |
Quantity | Value | Units | Method | Reference | Comment |
ρc | 2.46 ± 0.05 | mol/l | N/A | Tsonopoulos and Ambrose, 1995 | |
ρc | 2.497 | mol/l | N/A | Chirico, Knipmeyer, et al., 1993 | Uncertainty assigned by TRC = 0.078 mol/l; TRC |
ρc | 2.450 | mol/l | N/A | Schroeer, 1941 | Uncertainty assigned by TRC = 0.04 mol/l; TRC |
ρc | 2.456 | mol/l | N/A | Zhuravlev, 1937 | Uncertainty assigned by TRC = 0.04 mol/l; TRC |
Quantity | Value | Units | Method | Reference | Comment |
ΔvapH° | 54.6 | kJ/mol | CGC | Zhao, Unhannanant, et al., 2008 | AC |
ΔvapH° | 60.3 ± 1.1 | kJ/mol | GC | Haftka, Parsons, et al., 2006 | Based on data from 333. to 403. K.; AC |
ΔvapH° | 53.4 | kJ/mol | CGC | Chickos, Hesse, et al., 1998 | AC |
ΔvapH° | 56.6 | kJ/mol | CGC | Chickos, Hosseini, et al., 1995 | Based on data from 403. to 453. K.; AC |
Quantity | Value | Units | Method | Reference | Comment |
ΔsubH° | 71. ± 5. | kJ/mol | AVG | N/A | Average of 17 values; Individual data points |
Enthalpy of vaporization
ΔvapH (kJ/mol) | Temperature (K) | Method | Reference | Comment |
---|---|---|---|---|
70.850 | 323. | N/A | Torres-Gomez, Barreiro-Rodriguez, et al., 1988 | DH |
56.1 | 398. | GC | Lei, Chankalal, et al., 2002 | Based on data from 323. to 473. K.; AC |
47.6 ± 1.8 | 491. to 747. | DSC | Boller and Wiedemann, 1998 | AC |
45.4 | 475. | DSC | Back, Grzyll, et al., 1996 | Based on data from 460. to 647. K.; AC |
48.7 ± 0.3 | 400. | EB | Chirico, Knipmeyer, et al., 1993, 2 | AC |
46.4 | 440. | EB | Chirico, Knipmeyer, et al., 1993, 2 | AC |
44.0 | 480. | EB | Chirico, Knipmeyer, et al., 1993, 2 | AC |
41.5 | 520. | EB | Chirico, Knipmeyer, et al., 1993, 2 | AC |
44.4 | 528. | N/A | Lee and Holder, 1993 | Based on data from 513. to 613. K.; AC |
47.9 | 423. | EB | Ambrose, Ewing, et al., 1990 | Based on data from 418. to 613. K.; AC |
50.6 | 367. | A | Stephenson and Malanowski, 1987 | Based on data from 352. to 500. K.; AC |
44.8 | 506. | A | Stephenson and Malanowski, 1987 | Based on data from 491. to 565. K.; AC |
43.2 | 578. | A | Stephenson and Malanowski, 1987 | Based on data from 563. to 663. K.; AC |
43.3 | 676. | A | Stephenson and Malanowski, 1987 | Based on data from 661. to 750. K.; AC |
50.3 ± 0.2 | 370. | N/A | de Kruif, Kuipers, et al., 1981 | Based on data from 353. to 388. K.; AC |
44.7 | 466. | N/A | Wilson, Johnston, et al., 1981 | Based on data from 441. to 727. K.; AC |
50.7 | 369. | N/A | Fowler, Trump, et al., 1968 | Based on data from 354. to 453. K.; AC |
49.0 | 414. | N/A | Camin and Rossini, 1955 | Based on data from 399. to 491. K.; AC |
46.4 | 441. | C | Barrow and McClellan, 1951 | AC |
48.3 | 379. | I | Cramer, 1943 | AC |
47.2 | 423. | I | Mortimer and Murphy, 1923 | Based on data from 373. to 473. K.; AC |
47.7 | 427. | I | NELSON and SENSEMAN, 1922 | Based on data from 360. to 494. K.; AC |
Entropy of vaporization
ΔvapS (J/mol*K) | Temperature (K) | Reference | Comment |
---|---|---|---|
219.3 | 323. | Torres-Gomez, Barreiro-Rodriguez, et al., 1988 | DH |
Antoine Equation Parameters
log10(P) = A − (B / (T + C))
P = vapor pressure (bar)
T = temperature (K)
View plot Requires a JavaScript / HTML 5 canvas capable browser.
Temperature (K) | A | B | C | Reference | Comment |
---|---|---|---|---|---|
353.48 to 452.30 | 4.27117 | 1831.571 | -61.329 | Fowler, Trump, et al., 1968 | Coefficents calculated by NIST from author's data. |
399.47 to 491.79 | 3.97067 | 1606.529 | -85.923 | Camin and Rossini, 1955 |
Enthalpy of sublimation
ΔsubH (kJ/mol) | Temperature (K) | Method | Reference | Comment |
---|---|---|---|---|
72.320 | 298.15 | N/A | Torres-Gomez, Barreiro-Rodriguez, et al., 1988 | DH |
72.8 | 327. | GS | Grayson and Fosbraey, 2006 | Based on data from 302. to 352. K.; AC |
64. ± 0.5 | 281. to 290. | LE | McEachern and Sandoval, 2001 | AC |
88.0 ± 2.5 | 267. to 303. | ME | Boller and Wiedemann, 1998 | AC |
71.7 | 333. | GS | Nass, Lenoir, et al., 1995 | Based on data from 313. to 353. K.; AC |
73.7 ± 1.0 | 258. | GS | Wania, Shiu, et al., 1994 | Based on data from 243. to 273. K.; AC |
78. ± 1. | 337. to 352. | GC | Khudyakov, 1988 | AC |
71. ± 4. | 323. | DSC | Torres-Gomez, Barreiro-Rodriguez, et al., 1988 | AC |
73.4 | 315. | GS | SATO, INOMATA, et al., 1986 | Based on data from 299. to 331. K.; AC |
72.3 ± 0.8 | 293. to 331. | QR | Glukhova, Arkhangelova, et al., 1985 | AC |
69.9 | 333. to 393. | GS | Matsubara and Kuwamoto, 1985 | AC |
75.8 ± 1.1 | 303. | GS | Sonnefeld, Zoller, et al., 1983 | Based on data from 283. to 323. K.; AC |
72.8 ± 0.3 | 271. to 285. | ME | Colomina, Jimenez, et al., 1982 | AC |
72.5 ± 0.1 | 274. to 353. | DM | de Kruif, Kuipers, et al., 1981 | AC |
72.6 ± 0.6 | 253. to 273. | TE | Kruif, 1980 | AC |
76.0 ± 2.0 | 328. to 398. | DSC | Murray, Cavell, et al., 1980 | AC |
71.3 | 293. | GS | Macknick and Prausnitz, 1979 | Based on data from 280. to 305. K.; AC |
74.8 ± 0.4 | 253. to 273. | TE | De Kruif and Van Ginkel, 1977 | AC |
73.9 ± 0.2 | 253. to 273. | ME | De Kruif and Van Ginkel, 1977 | AC |
72.5 ± 0.3 | 263. to 343. | DM | Ambrose, Lawrenson, et al., 1975 | AC |
67.8 ± 3.5 | 280. | HSA | Chickos, 1975 | AC |
74.4 ± 1.7 | 303. to 329. | TSGC | McEachern, Sandoval, et al., 1975 | AC |
72.7 ± 1.7 | 283. | V | Radchenko and Kitaigorodskii, 1974 | ALS |
72.7 | 283. to 323. | ME | Radchenko, 1971 | AC |
66.53 ± 0.84 | 283. | V | Karyakin, Rabinovich, et al., 1968 | ALS |
72.7 ± 0.3 | 230. to 260. | KG | Miller, 1963 | See also Cox and Pilcher, 1970.; AC |
66.3 ± 2.3 | 354.7 | V | Aihara, 1959 | crystal phase; ALS |
66.3 | 276. to 283. | V | Aihara, 1959, 2 | AC |
69.2 | 268. | N/A | Hoyer and Peperle, 1958 | Based on data from 253. to 283. K.; AC |
65.8 | 293. | Effusion | Sklyarenko, Markin, et al., 1958 | Based on data from 283. to 303. K.; AC |
72.1 | 292. | N/A | Sherwood and Bryant, 1957 | Based on data from 273. to 311. K.; AC |
72.4 | 279. to 294. | N/A | Bradley and Cleasby, 1953 | See also Jones, 1960 and Sears and Hopke, 1954.; AC |
72.383 | 279.7 | V | Bradley and Cleasby, 1953, 2 | ALS |
65.7 | 297. | Effusion | Zibberman-Granovskaya, 1940 | Based on data from 288. to 306. K.; AC |
76.6 | 237. to 276. | N/A | Andrews, 1925 | AC |
82.0 | 293. | ME | Swan and Mack, 1925 | Based on data from 283. to 303. K.; AC |
Entropy of sublimation
ΔsubS (J/mol*K) | Temperature (K) | Reference | Comment |
---|---|---|---|
242.6 | 298.15 | Torres-Gomez, Barreiro-Rodriguez, et al., 1988 | DH |
Enthalpy of fusion
ΔfusH (kJ/mol) | Temperature (K) | Method | Reference | Comment |
---|---|---|---|---|
18.811 | 353.44 | N/A | Mastrangelo, 1957 | DH |
18.226 | 353.43 | N/A | McCullough, Finke, et al., 1957 | DH |
19.200 | 353.0 | N/A | Spaght, Thomas, et al., 1932 | DH |
19.1 | 353.5 | DSC | Sharma, Gupta, et al., 2008 | AC |
16.44 | 353.8 | DSC | Hafsaoui and Mahmoud, 2007 | AC |
19.55 | 354.7 | DSC | Khimeche and Dahmani, 2006 | AC |
19.55 | 354.7 | DSC | Khimeche and Dahmani, 2006, 2 | AC |
19.0 | 353.4 | AC | Chirico, Knipmeyer, et al., 2002 | Based on data from 5. to 440. K.; AC |
19.1 | 353.4 | N/A | Acree, 1991 | AC |
19.020 | 354.1 | N/A | Syunyaev, Tumanyan, et al., 1984 | Relative error in determination ± 5%.; DH |
19.100 | 353.5 | N/A | Rastogi and Bassi, 1964 | DH |
18.785 | 353. | N/A | Ueberreiter and Orthmann, 1950 | DH |
18.790 | 353.4 | N/A | Eibert, 1944 | DH |
19.040 | 353.4 | N/A | Schmidt, 1941 | DH |
19.000 | 353.1 | N/A | Andrews, Lynn, et al., 1926 | DH |
19.250 | 353. | N/A | David, 1964 | Temperature not measured.; DH |
Entropy of fusion
ΔfusS (J/mol*K) | Temperature (K) | Reference | Comment |
---|---|---|---|
51.57 | 353.43 | McCullough, Finke, et al., 1957 | DH |
54.4 | 353.0 | Spaght, Thomas, et al., 1932 | DH |
53.7 | 354.1 | Syunyaev, Tumanyan, et al., 1984 | Relative; DH |
54.0 | 353.5 | Rastogi and Bassi, 1964 | DH |
53.2 | 353. | Ueberreiter and Orthmann, 1950 | DH |
53.2 | 353.4 | Eibert, 1944 | DH |
53.9 | 353.4 | Schmidt, 1941 | DH |
53.8 | 353.1 | Andrews, Lynn, et al., 1926 | DH |
55. | 353. | David, 1964 | Temperature; DH |
Enthalpy of phase transition
ΔHtrs (kJ/mol) | Temperature (K) | Initial Phase | Final Phase | Reference | Comment |
---|---|---|---|---|---|
19.046 | 353.376 | crystaline, I | liquid | Andon and Connett, 1980 | DH |
19.000 | 353.8 | crystaline, I | liquid | Radomska and Radomski, 1980 | DH |
Entropy of phase transition
ΔStrs (J/mol*K) | Temperature (K) | Initial Phase | Final Phase | Reference | Comment |
---|---|---|---|---|---|
53.90 | 353.376 | crystaline, I | liquid | Andon and Connett, 1980 | DH |
53.70 | 353.8 | crystaline, I | liquid | Radomska and Radomski, 1980 | DH |

Henry's Law data

Data compiled by: Rolf Sander
Henry's Law constant (water solution)
kH(T) = k°H exp(d(ln(kH))/d(1/T) ((1/T) - 1/(298.15 K)))
k°H = Henry's law constant for solubility in water at 298.15 K (mol/(kg*bar))
d(ln(kH))/d(1/T) = Temperature dependence constant (K)
k°H (mol/(kg*bar)) | d(ln(kH))/d(1/T) (K) | Method | Reference | Comment |
---|---|---|---|---|
0.80 | Q | N/A | missing citation give several references for the Henry's law constants but don't assign them to specific species. | |
2.0 | X | N/A | ||
2.1 | 3600. | X | N/A | |
2.4 | L | N/A | ||
2.1 | M | Mackay, Shiu, et al., 1979 | ||
2.1 | T | Mackay, Shiu, et al., 1979 | ||
2.4 | V | N/A | ||
1.9 | V | Bohon and Claussen, 1951 |

Condensed phase thermochemistry data

Data compiled as indicated in comments:
DH - Eugene S. Domalski and Elizabeth D. Hearing
DRB - Donald R. Burgess, Jr.
ALS - Hussein Y. Afeefy, Joel F. Liebman, and Stephen E. Stein
Quantity | Value | Units | Method | Reference | Comment |
---|---|---|---|---|---|
S°liquid | 52.005 | cal/mol*K | N/A | Chirico, Knipmeyer, et al., 1993 | DH |
Quantity | Value | Units | Method | Reference | Comment |
ΔfH°solid | 18. ± 2. | kcal/mol | AVG | N/A | Average of 7 values; Individual data points |
Quantity | Value | Units | Method | Reference | Comment |
ΔcH°solid | -1232. ± 5. | kcal/mol | AVG | N/A | Average of 18 values; Individual data points |
Quantity | Value | Units | Method | Reference | Comment |
S°solid,1 bar | 40.010 | cal/mol*K | N/A | McCullough, Finke, et al., 1957 | DH |
S°solid,1 bar | 38.920 | cal/mol*K | N/A | Southard and Brickwedde, 1933 | DH |
S°solid,1 bar | 39.880 | cal/mol*K | N/A | Pearce and Tanner, 1934 | Extrapolation below 90 K, 58.32 J/mol*K.; DH |
S°solid,1 bar | 39.89 | cal/mol*K | N/A | Huffman, Parks, et al., 1930 | Extrapolation below 90 K, 53.09 J/mol*K.; DH |
Constant pressure heat capacity of liquid
Cp,liquid (cal/mol*K) | Temperature (K) | Reference | Comment |
---|---|---|---|
46.859 | 298.15 | Chirico, Knipmeyer, et al., 1993 | T = 260 to 700 K.; DH |
Constant pressure heat capacity of solid
Cp,solid (cal/mol*K) | Temperature (K) | Reference | Comment |
---|---|---|---|
50.9 | 330. | David, 1964 | T = 298 to 353 K. Mean value. T = uncertain.; DH |
45.03 | 342. | Rastogi and Bassi, 1964 | T = 342, 384 K.; DH |
39.601 | 298.15 | McCullough, Finke, et al., 1957 | T = 10 to 370 K.; DH |
37.31 | 298.15 | Ueberreiter and Orthmann, 1950 | T = 293 to 368 K. Equation only.; DH |
46.80 | 298.1 | Eibert, 1944 | T = 30 to 200°C, equations only in t°C. Cp(c) = 0.365 cal/g*K (30 to 80°C); Cp(liq) = 0.329 + 0.000824t cal/g*K (80 to 200°C).; DH |
38.60 | 298.1 | Schmidt, 1941 | T = 22 to 200°C, equations only, in t°C. Cp(c) = 0.2595 + 0.001672t cal/g*K (22 to 80°C); Cp(liq) = 0.3360 + 0.0008180t cal/g*K (80 to 200°C).; DH |
40.179 | 301.58 | Hicks, 1938 | T = 58 to 304 K. Value is unsmoothed experimental datum.; DH |
40.170 | 297.6 | Pearce and Tanner, 1934 | T = 94 to 298 K. Value is unsmoothed experimental datum.; DH |
39.551 | 294.68 | Southard and Brickwedde, 1933 | T = 15 to 295 K. Value is unsmoothed experimental datum.; DH |
40.39 | 303. | Spaght, Thomas, et al., 1932 | T = 30 to 190°C.; DH |
39.10 | 295.1 | Huffman, Parks, et al., 1930 | T = 91 to 295 K.; DH |
38.10 | 298. | Andrews, Lynn, et al., 1926 | T = 12 to 300°C.; DH |

Reaction thermochemistry data

Data compiled as indicated in comments:
B - John E. Bartmess
M - Michael M. Meot-Ner (Mautner) and Sharon G. Lias
ALS - Hussein Y. Afeefy, Joel F. Liebman, and Stephen E. Stein
Individual Reactions
C10H7- + =
By formula: C10H7- + H+ = C10H8
Quantity | Value | Units | Method | Reference | Comment |
---|---|---|---|---|---|
ΔrH° | 394.2 ± 1.2 | kcal/mol | Bran | Reed and Kass, 2000 | gas phase; B |
ΔrH° | 394.2 ± 1.2 | kcal/mol | TDEq | Meot-ner, Liebman, et al., 1988 | gas phase; anchored to 88MEO scale, not the "87 acidity scale". The Kiefer, Zhang, et al., 1997 BDE is for ortho.; B |
ΔrH° | 394.0 ± 5.0 | kcal/mol | CIDC | Lardin, Squires, et al., 2001 | gas phase; B |
Quantity | Value | Units | Method | Reference | Comment |
ΔrG° | 385.6 ± 1.3 | kcal/mol | H-TS | Reed and Kass, 2000 | gas phase; B |
ΔrG° | 383.8 ± 1.2 | kcal/mol | TDEq | Meot-ner, Liebman, et al., 1988 | gas phase; anchored to 88MEO scale, not the "87 acidity scale". The Kiefer, Zhang, et al., 1997 BDE is for ortho.; B |
ΔrG° | 385.4 ± 5.1 | kcal/mol | H-TS | Lardin, Squires, et al., 2001 | gas phase; B |
By formula: C6H7N+ + C10H8 = (C6H7N+ • C10H8)
Bond type: Charge transfer bond (positive ion)
Quantity | Value | Units | Method | Reference | Comment |
---|---|---|---|---|---|
ΔrH° | 15.4 | kcal/mol | PHPMS | El-Shall and Meot-Ner (Mautner), 1987 | gas phase; Entropy change calculated or estimated; M |
Quantity | Value | Units | Method | Reference | Comment |
ΔrS° | 26. | cal/mol*K | N/A | El-Shall and Meot-Ner (Mautner), 1987 | gas phase; Entropy change calculated or estimated; M |
Free energy of reaction
ΔrG° (kcal/mol) | T (K) | Method | Reference | Comment |
---|---|---|---|---|
7.3 | 324. | PHPMS | El-Shall and Meot-Ner (Mautner), 1987 | gas phase; Entropy change calculated or estimated; M |
By formula: C12H8+ + C10H8 = (C12H8+ • C10H8)
Bond type: Charge transfer bond (positive ion)
Quantity | Value | Units | Method | Reference | Comment |
---|---|---|---|---|---|
ΔrH° | 12.6 | kcal/mol | PHPMS | Meot-Ner (Mautner), 1980 | gas phase; Entropy change calculated or estimated; M |
Quantity | Value | Units | Method | Reference | Comment |
ΔrS° | 28. | cal/mol*K | N/A | Meot-Ner (Mautner), 1980 | gas phase; Entropy change calculated or estimated; M |
Quantity | Value | Units | Method | Reference | Comment |
ΔrG° | 5.1 | kcal/mol | PHPMS | Meot-Ner (Mautner), 1980 | gas phase; Entropy change calculated or estimated; M |
By formula: C12H9+ + C10H8 = (C12H9+ • C10H8)
Bond type: Charge transfer bond (positive ion)
Quantity | Value | Units | Method | Reference | Comment |
---|---|---|---|---|---|
ΔrH° | 13.9 | kcal/mol | PHPMS | Meot-Ner (Mautner), 1980 | gas phase; Entropy change calculated or estimated; M |
Quantity | Value | Units | Method | Reference | Comment |
ΔrS° | 28. | cal/mol*K | N/A | Meot-Ner (Mautner), 1980 | gas phase; Entropy change calculated or estimated; M |
Quantity | Value | Units | Method | Reference | Comment |
ΔrG° | 6.4 | kcal/mol | PHPMS | Meot-Ner (Mautner), 1980 | gas phase; Entropy change calculated or estimated; M |
By formula: 2H2 + C10H8 = C10H12
Quantity | Value | Units | Method | Reference | Comment |
---|---|---|---|---|---|
ΔrH° | -29.8 | kcal/mol | Eqk | Frye and Weitkamp, 1969 | gas phase; ALS |
ΔrH° | -28.8 ± 1.2 | kcal/mol | Eqk | Wilson, Caflisch, et al., 1958 | gas phase; Reanalyzed by Cox and Pilcher, 1970, 2, Original value = -32.0 ± 1.2 kcal/mol; At 400 K; ALS |
By formula: C10H8 = C10H8
Quantity | Value | Units | Method | Reference | Comment |
---|---|---|---|---|---|
ΔrH° | -59.4 ± 1.9 | kcal/mol | Eqk | Dreeskamp, Kapahnke, et al., 1988 | liquid phase; solvent: Heptane; Isomerization; ALS |
ΔrH° | -59.6 ± 1.9 | kcal/mol | Ciso | Grimme and Heinze, 1978 | liquid phase; solvent: Heptane; ALS |
By formula: C10H8+ + C10H8 = (C10H8+ • C10H8)
Bond type: Charge transfer bond (positive ion)
Quantity | Value | Units | Method | Reference | Comment |
---|---|---|---|---|---|
ΔrH° | 17.8 | kcal/mol | PHPMS | Meot-Ner (Mautner), 1980 | gas phase; M |
Quantity | Value | Units | Method | Reference | Comment |
ΔrS° | 29. | cal/mol*K | PHPMS | Meot-Ner (Mautner), 1980 | gas phase; M |
C10H7- + =
By formula: C10H7- + H+ = C10H8
Quantity | Value | Units | Method | Reference | Comment |
---|---|---|---|---|---|
ΔrH° | 395.5 ± 1.3 | kcal/mol | Bran | Reed and Kass, 2000 | gas phase; B |
Quantity | Value | Units | Method | Reference | Comment |
ΔrG° | 386.9 ± 1.4 | kcal/mol | H-TS | Reed and Kass, 2000 | gas phase; B |
By formula: H4O4- + C10H8 + 2H2O = C10H12O4-
Quantity | Value | Units | Method | Reference | Comment |
---|---|---|---|---|---|
ΔrH° | 52.3 ± 2.3 | kcal/mol | N/A | Le Barbu, Schiedt, et al., 2002 | gas phase; Affinity is difference in EAs of lesser solvated species; B |
By formula: H2O3- + C10H8 + H2O = C10H10O3-
Quantity | Value | Units | Method | Reference | Comment |
---|---|---|---|---|---|
ΔrH° | 37.8 ± 2.3 | kcal/mol | N/A | Le Barbu, Schiedt, et al., 2002 | gas phase; Affinity is difference in EAs of lesser solvated species; B |
By formula: C10H9+ + C10H8 = (C10H9+ • C10H8)
Quantity | Value | Units | Method | Reference | Comment |
---|---|---|---|---|---|
ΔrH° | 14.1 | kcal/mol | PHPMS | Meot-Ner (Mautner), 1980 | gas phase; M |
Quantity | Value | Units | Method | Reference | Comment |
ΔrS° | 30. | cal/mol*K | PHPMS | Meot-Ner (Mautner), 1980 | gas phase; M |
+
= C10H8O2-
By formula: O2- + C10H8 = C10H8O2-
Quantity | Value | Units | Method | Reference | Comment |
---|---|---|---|---|---|
ΔrH° | 22.1 ± 2.3 | kcal/mol | N/A | Le Barbu, Schiedt, et al., 2002 | gas phase; Affinity is difference in EAs of lesser solvated species; B |
+
= C10H8NO-
By formula: NO- + C10H8 = C10H8NO-
Quantity | Value | Units | Method | Reference | Comment |
---|---|---|---|---|---|
ΔrH° | 14.5 ± 2.3 | kcal/mol | N/A | Le Barbu, Schiedt, et al., 2002 | gas phase; Affinity is difference in EAs of lesser solvated species; B |
By formula: C10H8NO- + 2C10H8 = C20H16NO-
Quantity | Value | Units | Method | Reference | Comment |
---|---|---|---|---|---|
ΔrH° | 23.8 ± 2.3 | kcal/mol | N/A | Le Barbu, Schiedt, et al., 2002 | gas phase; Affinity is difference in EAs of lesser solvated species; B |
By formula: 5H2 + C10H8 = C10H18
Quantity | Value | Units | Method | Reference | Comment |
---|---|---|---|---|---|
ΔrH° | -76.0 | kcal/mol | Eqk | Frye and Weitkamp, 1969 | gas phase; ALS |

Gas phase ion energetics data

Data evaluated as indicated in comments:
HL - Edward P. Hunter and Sharon G. Lias
L - Sharon G. Lias
Data compiled as indicated in comments:
B - John E. Bartmess
MM - Michael M. Meot-Ner (Mautner)
LL - Sharon G. Lias and Joel F. Liebman
LBLHLM - Sharon G. Lias, John E. Bartmess, Joel F. Liebman, John L. Holmes, Rhoda D. Levin, and W. Gary Mallard
LLK - Sharon G. Lias, Rhoda D. Levin, and Sherif A. Kafafi
RDSH - Henry M. Rosenstock, Keith Draxl, Bruce W. Steiner, and John T. Herron
Quantity | Value | Units | Method | Reference | Comment |
---|---|---|---|---|---|
IE (evaluated) | 8.144 ± 0.001 | eV | N/A | N/A | L |
Quantity | Value | Units | Method | Reference | Comment |
Proton affinity (review) | 191.9 | kcal/mol | N/A | Hunter and Lias, 1998 | HL |
Quantity | Value | Units | Method | Reference | Comment |
Gas basicity | 186.3 | kcal/mol | N/A | Hunter and Lias, 1998 | HL |
Electron affinity determinations
EA (eV) | Method | Reference | Comment |
---|---|---|---|
-0.2 | LPES | Lyapustina, Xu, et al., 2000 | Extrapolated from EAs of solvation series naphthalene-...(H2O)n; B |
-0.18 | N/A | Song, Han, et al., 2002 | Extrapolated from LPES EAs of (naphthalene)n; B |
-0.200 ± 0.050 | LPES | Schiedt, Knott, et al., 2000 | Extrapolated from EAs of (H2O)n..naphthalene-. series; B |
-0.1908 | ETS | Burrow, Michejda, et al., 1987 | The question of whether the naphthalene radical anion is bound or not has not been settled; B |
0.140 ± 0.050 | ECD | Zlatkis, Lee, et al., 1983 | However, see Heinis, Chowdhury, et al., 1993 for a discussion; it may not be bound.; B |
<0.134 ± 0.043 | ECD | Wojnarovits and Foldiak, 1981 | EA is an upper limit: Chen and Wentworth, 1989. G3MP2B3 calculations indicate an EA of ca. -0.3 eV, anion unbound.; B |
0.1480 ± 0.0060 | ECD | Becker and Chen, 1966 | B |
Proton affinity at 298K
Proton affinity (kcal/mol) | Reference | Comment |
---|---|---|
191.2 | Aue, Guidoni, et al., 2000 | Experimental literature data re-evaluated by the authors using ab initio protonation entropies; MM |
Gas basicity at 298K
Gas basicity (review) (kcal/mol) | Reference | Comment |
---|---|---|
185.1 | Aue, Guidoni, et al., 2000 | Experimental literature data re-evaluated by the authors using ab initio protonation entropies; MM |
Ionization energy determinations
Appearance energy determinations
De-protonation reactions
C10H7- + =
By formula: C10H7- + H+ = C10H8
Quantity | Value | Units | Method | Reference | Comment |
---|---|---|---|---|---|
ΔrH° | 394.2 ± 1.2 | kcal/mol | Bran | Reed and Kass, 2000 | gas phase; B |
ΔrH° | 394.2 ± 1.2 | kcal/mol | TDEq | Meot-ner, Liebman, et al., 1988 | gas phase; anchored to 88MEO scale, not the "87 acidity scale". The Kiefer, Zhang, et al., 1997 BDE is for ortho.; B |
ΔrH° | 394.0 ± 5.0 | kcal/mol | CIDC | Lardin, Squires, et al., 2001 | gas phase; B |
Quantity | Value | Units | Method | Reference | Comment |
ΔrG° | 385.6 ± 1.3 | kcal/mol | H-TS | Reed and Kass, 2000 | gas phase; B |
ΔrG° | 383.8 ± 1.2 | kcal/mol | TDEq | Meot-ner, Liebman, et al., 1988 | gas phase; anchored to 88MEO scale, not the "87 acidity scale". The Kiefer, Zhang, et al., 1997 BDE is for ortho.; B |
ΔrG° | 385.4 ± 5.1 | kcal/mol | H-TS | Lardin, Squires, et al., 2001 | gas phase; B |
C10H7- + =
By formula: C10H7- + H+ = C10H8
Quantity | Value | Units | Method | Reference | Comment |
---|---|---|---|---|---|
ΔrH° | 395.5 ± 1.3 | kcal/mol | Bran | Reed and Kass, 2000 | gas phase; B |
Quantity | Value | Units | Method | Reference | Comment |
ΔrG° | 386.9 ± 1.4 | kcal/mol | H-TS | Reed and Kass, 2000 | gas phase; B |

Ion clustering data

Data compiled as indicated in comments:
M - Michael M. Meot-Ner (Mautner) and Sharon G. Lias
B - John E. Bartmess
Clustering reactions
By formula: C6H7N+ + C10H8 = (C6H7N+ • C10H8)
Bond type: Charge transfer bond (positive ion)
Quantity | Value | Units | Method | Reference | Comment |
---|---|---|---|---|---|
ΔrH° | 15.4 | kcal/mol | PHPMS | El-Shall and Meot-Ner (Mautner), 1987 | gas phase; Entropy change calculated or estimated; M |
Quantity | Value | Units | Method | Reference | Comment |
ΔrS° | 26. | cal/mol*K | N/A | El-Shall and Meot-Ner (Mautner), 1987 | gas phase; Entropy change calculated or estimated; M |
Free energy of reaction
ΔrG° (kcal/mol) | T (K) | Method | Reference | Comment |
---|---|---|---|---|
7.3 | 324. | PHPMS | El-Shall and Meot-Ner (Mautner), 1987 | gas phase; Entropy change calculated or estimated; M |
By formula: C10H8+ + C10H8 = (C10H8+ • C10H8)
Bond type: Charge transfer bond (positive ion)
Quantity | Value | Units | Method | Reference | Comment |
---|---|---|---|---|---|
ΔrH° | 17.8 | kcal/mol | PHPMS | Meot-Ner (Mautner), 1980 | gas phase; M |
Quantity | Value | Units | Method | Reference | Comment |
ΔrS° | 29. | cal/mol*K | PHPMS | Meot-Ner (Mautner), 1980 | gas phase; M |
By formula: C10H8NO- + 2C10H8 = C20H16NO-
Quantity | Value | Units | Method | Reference | Comment |
---|---|---|---|---|---|
ΔrH° | 23.8 ± 2.3 | kcal/mol | N/A | Le Barbu, Schiedt, et al., 2002 | gas phase; Affinity is difference in EAs of lesser solvated species; B |
By formula: C10H9+ + C10H8 = (C10H9+ • C10H8)
Quantity | Value | Units | Method | Reference | Comment |
---|---|---|---|---|---|
ΔrH° | 14.1 | kcal/mol | PHPMS | Meot-Ner (Mautner), 1980 | gas phase; M |
Quantity | Value | Units | Method | Reference | Comment |
ΔrS° | 30. | cal/mol*K | PHPMS | Meot-Ner (Mautner), 1980 | gas phase; M |
By formula: C12H8+ + C10H8 = (C12H8+ • C10H8)
Bond type: Charge transfer bond (positive ion)
Quantity | Value | Units | Method | Reference | Comment |
---|---|---|---|---|---|
ΔrH° | 12.6 | kcal/mol | PHPMS | Meot-Ner (Mautner), 1980 | gas phase; Entropy change calculated or estimated; M |
Quantity | Value | Units | Method | Reference | Comment |
ΔrS° | 28. | cal/mol*K | N/A | Meot-Ner (Mautner), 1980 | gas phase; Entropy change calculated or estimated; M |
Quantity | Value | Units | Method | Reference | Comment |
ΔrG° | 5.1 | kcal/mol | PHPMS | Meot-Ner (Mautner), 1980 | gas phase; Entropy change calculated or estimated; M |
By formula: C12H9+ + C10H8 = (C12H9+ • C10H8)
Bond type: Charge transfer bond (positive ion)
Quantity | Value | Units | Method | Reference | Comment |
---|---|---|---|---|---|
ΔrH° | 13.9 | kcal/mol | PHPMS | Meot-Ner (Mautner), 1980 | gas phase; Entropy change calculated or estimated; M |
Quantity | Value | Units | Method | Reference | Comment |
ΔrS° | 28. | cal/mol*K | N/A | Meot-Ner (Mautner), 1980 | gas phase; Entropy change calculated or estimated; M |
Quantity | Value | Units | Method | Reference | Comment |
ΔrG° | 6.4 | kcal/mol | PHPMS | Meot-Ner (Mautner), 1980 | gas phase; Entropy change calculated or estimated; M |
By formula: H2O3- + C10H8 + H2O = C10H10O3-
Quantity | Value | Units | Method | Reference | Comment |
---|---|---|---|---|---|
ΔrH° | 37.8 ± 2.3 | kcal/mol | N/A | Le Barbu, Schiedt, et al., 2002 | gas phase; Affinity is difference in EAs of lesser solvated species; B |
By formula: H4O4- + C10H8 + 2H2O = C10H12O4-
Quantity | Value | Units | Method | Reference | Comment |
---|---|---|---|---|---|
ΔrH° | 52.3 ± 2.3 | kcal/mol | N/A | Le Barbu, Schiedt, et al., 2002 | gas phase; Affinity is difference in EAs of lesser solvated species; B |
+
= C10H8NO-
By formula: NO- + C10H8 = C10H8NO-
Quantity | Value | Units | Method | Reference | Comment |
---|---|---|---|---|---|
ΔrH° | 14.5 ± 2.3 | kcal/mol | N/A | Le Barbu, Schiedt, et al., 2002 | gas phase; Affinity is difference in EAs of lesser solvated species; B |
+
= C10H8O2-
By formula: O2- + C10H8 = C10H8O2-
Quantity | Value | Units | Method | Reference | Comment |
---|---|---|---|---|---|
ΔrH° | 22.1 ± 2.3 | kcal/mol | N/A | Le Barbu, Schiedt, et al., 2002 | gas phase; Affinity is difference in EAs of lesser solvated species; B |

Normal alkane RI, non-polar column, custom temperature program

Data compiled by: NIST Mass Spectrometry Data Center, William E. Wallace, director

Column type CapillaryCapillaryCapillaryCapillaryCapillary
Active phase HP-5 MSSLB-5 MSSLB-5 MSPolydimethyl siloxane with 5 % Ph groupsPolydimethyl siloxane with 5 % Ph groups
Column length (m) 30.30.30.
Carrier gas HeliumHeliumHelium
Substrate
Column diameter (mm) 0.250.250.25
Phase thickness (μm) 0.250.250.25
Program not specifiednot specifiednot specifiednot specifiednot specified
I 1179.1178.1194.1191.1197.
ReferenceKotowska, Zalikowski, et al., 2012Mondello, 2012Mondello, 2012Robinson, Adams, et al., 2012Robinson, Adams, et al., 2012
Comment MSDC-RI MSDC-RI MSDC-RI MSDC-RI MSDC-RI
Column type CapillaryCapillaryCapillaryCapillaryCapillary
Active phase VF-5VF-5HP-1HP-5 MSRTX-5 MS
Column length (m) 30.30. 30.30.
Carrier gas HeliumHeliumHeliumHeliumHelium
Substrate
Column diameter (mm) 0.250.25 0.250.25
Phase thickness (μm) 0.250.25 0.250.25
Program 50 0C (2 min) 3 0C/min -> 200 0C (3 min) 10 0C/min -> 220 0C (8 min)not specifiednot specified40 0C (5 min) 2 0C/min -> 270 0C -> 260 0C (20 min)50 0C (5 min) 2 0C/min -> 100 0C (5 min) 5 0C/min -> 300 0C
I 1186.1179.1190.1179.1181.
ReferenceShivashankar, Roy, et al., 2012Shivashankar, Roy, et al., 2012Grigor'ev, Bozhko, et al., 2009Mancini, Arnold, et al., 2009Mebazaa, Mahmoudi, et al., 2009
Comment MSDC-RI MSDC-RI MSDC-RI MSDC-RI MSDC-RI
Column type CapillaryCapillaryCapillaryCapillaryCapillary
Active phase RTX-5 MSSqualaneSqualaneNonpolarNonpolar
Column length (m) 30.
Carrier gas Helium
Substrate
Column diameter (mm) 0.25
Phase thickness (μm) 0.25
Program not specifiednot specifiednot specifiednot specifiednot specified
I 1179.1152.1210.1182.1187.
ReferenceMebazaa, Mahmoudi, et al., 2009Chen, 2008Chen, 2008Staples and Zeiger, 2008Staples and Zeiger, 2008
Comment MSDC-RI MSDC-RI MSDC-RI MSDC-RI MSDC-RI
Column type CapillaryCapillaryCapillaryCapillaryCapillary
Active phase HP-5 MSHP-5HP-5DB-5 MSDB-5 MS
Column length (m) 30.30.30.30.30.
Carrier gas Helium  HeliumHelium
Substrate
Column diameter (mm) 0.250.250.250.250.25
Phase thickness (μm) 0.250.250.250.250.25
Program 40 0C (2 min) 4 0C/min -> 220 0C 20 0C/min -> 280 0C40 0C (2 min) 5 0C/min -> 80 0C 7 oC/min -> 160 0C 9 0C/min -> 200 0C 20 0C/min -> 280 0C (10 min)not specified50 0C (2.8 min) 5.5 0C/min -> 140 0C (1 min) 4.5 oC/min -> 220 0C -> 225 0C (2 min) 3.4 0C/min -> 265 0C (5 min)50 0C (2.8 min) 5.5 0C/min -> 140 0C (1 min) 4.5 oC/min -> 220 0C -> 225 0C (2 min) 3.4 0C/min -> 265 0C (5 min)
I 1190.1184.1179.1158.1183.
ReferenceXie, Sun, et al., 2008Zhao, Li, et al., 2008Zhao, Li, et al., 2008Zhu, Li, et al., 2008Zhu, Li, et al., 2008
Comment MSDC-RI MSDC-RI MSDC-RI MSDC-RI MSDC-RI
Column type CapillaryCapillaryCapillaryCapillaryCapillary
Active phase HP-5HP-5MSBPX-5DB-1HP-5MS
Column length (m) 30.30.30.30.30.
Carrier gas HeHeHeHeHe
Substrate
Column diameter (mm) 0.320.250.250.250.25
Phase thickness (μm) 0.250.250.250.250.25
Program 40 0C (2 min) 110 0C (2 min) 3 0C/min -> 170 0C (2 min) 4 0C/min -> 220 0C (2 min) 10 0C/min -> 260 0C (5 min)40C(10min) => 3C/min => 200C => 2C/min => 220C50C => 3C/min => 150C(10min) => 10C/min => 250C45C => 3C/min => 175C => 15C/min => 300C (10min)40C(5min) => 2C/min => 250C (15min) => 10C/min => 270C
I 1179.1179.1178.1139.1179.
ReferenceDou, Li, et al., 2007Moronkola, Ogunwande, et al., 2007Salamci, Kordali, et al., 2007Figueiredo A.C., Barroso J.G., et al., 2006Senatore, Apostolides Arnold, et al., 2006
Comment MSDC-RI MSDC-RI MSDC-RI MSDC-RI MSDC-RI
Column type CapillaryCapillaryCapillaryCapillaryCapillary
Active phase RTX-5HP-5HP-5MSApiezon LDB-5MS
Column length (m) 30. 30.
Carrier gas N2
Substrate
Column diameter (mm) 0.25 0.25
Phase thickness (μm) 0.25 0.25
Program not specifiednot specified40C(3min) => 4C/min => 75C => 8C/min => 250Cnot specifiednot specified
I 1190.1170.1171.1137.1179.
ReferenceÁdámová, Orinák, et al., 2005Riu-Aumatell, Lopez-Tamames, et al., 2005Vichi, Pizzale, et al., 2005Finkelstein, Kurbatova, et al., 2002Fu, Yoon, et al., 2002
Comment MSDC-RI MSDC-RI MSDC-RI MSDC-RI MSDC-RI
Column type CapillaryCapillaryCapillaryCapillaryCapillary
Active phase HP-5MSCP Sil 8 CBDB-5 MSHP-5BPX-5
Column length (m) 30.60.30.30.50.
Carrier gas He HeliumHeHelium
Substrate
Column diameter (mm) 0.250.250.250.250.32
Phase thickness (μm) 0.250.251.00.250.50
Program 40C (10min) => 3C/min => 120C => 10C/min => 250C (5min)not specifiednot specified40C (10min) => 3C/min => 120C => 10C/min => 250C (5min)40 0C (5 min) 20 0C/min -> 60 0C (5 min) 4 0C/min -> 250 0C (10 min)
I 1176.1215.1197.1175.1212.
ReferenceAnsorena, Gimeno, et al., 2001Duckham, Dodson, et al., 2001Luo and Agnew, 2001Ansorena, Astiasarán, et al., 2000Madruga, Arruda, et al., 2000
Comment MSDC-RI MSDC-RI MSDC-RI MSDC-RI MSDC-RI
Column type CapillaryCapillaryCapillaryCapillaryCapillary
Active phase DB-1HP Ultra 1HP-5DB-1DB-5
Column length (m) 30.25.50.30.50.
Carrier gas H2NitrogenHeH2He
Substrate
Column diameter (mm) 0.250.200.320.250.32
Phase thickness (μm) 0.250.330.520.250.25
Program 40 0C 3 K/min -> 175 0C 15 K/min -> 240 0C (10 min)50 0C 4 0C/min -> 180 0C 10 0C/min -> 280 0C35 0C 10 0C/min -> 200 0C (20 min) 5 0C/min -> 230 0C (50 min)45 0C 3 0C/min -> 175 0C 15 0C/min -> 240 0C (10 min)40C (10min) => 3C/min => 95C => 10C/min => 270C (10min)
I 1139.1162.1222.1139.1210.
Referenceda Silva, Pedro, et al., 2000Hernandes, Vargas-Arispuro, et al., 1999Timón, Ventanas, et al., 1998Barroso, Figueiredo, et al., 1996Mateo and Zumalacárregui, 1996
Comment MSDC-RI MSDC-RI MSDC-RI MSDC-RI MSDC-RI
Column type CapillaryCapillaryCapillaryCapillaryCapillary
Active phase DB-5DB-1Methyl SiliconeRSL-150DB-1
Column length (m) 50.30. 60.60.
Carrier gas He  He
Substrate
Column diameter (mm) 0.320.53 0.320.32
Phase thickness (μm) 0.251.5 0.250.25
Program 40C (10min) => 3C/min => 95C => 10C/min => 270C (10min)40 0C (4 min) 8 0C/min -> 200 0C (1 min) 5 0C/min -> 280 0C (20 min)not specified30c (1.5min) => 20C/min => 55C => 6C/min => 200C(10min)not specified
I 1220.1185.1164.1164.1157.
ReferenceMateo and Zumalacárregui, 1996Peng, 1996Zenkevich, 1996Buchbauer, Nikiforov, et al., 1994Ciccioli, Cecinato, et al., 1994
Comment MSDC-RI MSDC-RI MSDC-RI MSDC-RI MSDC-RI
Column type CapillaryCapillaryCapillaryCapillaryCapillary
Active phase OV-1SPB-1Methyl SiliconeOV-101Polydimethyl siloxane, unknown content of Ph-groups
Column length (m)  30. 52.
Carrier gas    H2
Substrate
Column diameter (mm)  0.32 0.25
Phase thickness (μm)    0.38
Program not specifiednot specifiednot specified70 - 160 C at 1.5 deg/min; 160 - 280 C at 15 deg/min 15 min at 280 Cnot specified
I 1183.71150.1164.1162.1186.
ReferenceDimov, Osman, et al., 1994Vezzani, Moretti, et al., 1994Zenkevich, 1994Matisová, Juranyiová, et al., 1991Geldon, 1989
Comment MSDC-RI MSDC-RI MSDC-RI MSDC-RI MSDC-RI
Column type CapillaryCapillaryCapillaryCapillaryCapillary
Active phase Polydimethyl siloxane, unknown content of Ph-groupsSE-30DB-1DB-1OV-101
Column length (m)  60.30.30.50.
Carrier gas  N2H2H2He
Substrate
Column diameter (mm)  0.320.250.250.24
Phase thickness (μm)   0.250.25
Program not specified50C(8min) => 3C/min => 150C => 35C/min => 275C (10min)30C (2min) => 2C/min => 150C => 4C/min => 250C30C (2min) => 2C/min => 150C => 4C/min => 250Cnot specified
I 1189.1160.1146.1157.1165.
ReferenceGeldon, 1989Ibrahim and Suffet, 1988Takeoka, Flath, et al., 1988Takeoka, Flath, et al., 1988Zenkevich and Malamakhov, 1987
Comment MSDC-RI MSDC-RI MSDC-RI MSDC-RI MSDC-RI
Column type CapillaryCapillaryCapillaryCapillaryCapillary
Active phase OV-1OV-1OV-1, SE-30, Methyl silicone, SP-2100, OV-101, DB-1, etc.OV-1, SE-30, Methyl silicone, SP-2100, OV-101, DB-1, etc.OV-1, SE-30, Methyl silicone, SP-2100, OV-101, DB-1, etc.
Column length (m) 50.50.50.50.50.
Carrier gas HydrogenHydrogenHydrogenHydrogenHydrogen
Substrate
Column diameter (mm) 0.320.320.320.320.32
Phase thickness (μm)
Program not specifiednot specifiednot specifiednot specifiednot specified
I 1155.1156.1150.1152.1155.
ReferenceWaggott and Davies, 1984Waggott and Davies, 1984Waggott and Davies, 1984Waggott and Davies, 1984Waggott and Davies, 1984
Comment MSDC-RI MSDC-RI MSDC-RI MSDC-RI MSDC-RI
Column type CapillaryCapillaryCapillaryCapillaryCapillary
Active phase OV-1, SE-30, Methyl silicone, SP-2100, OV-101, DB-1, etc.OV-1, SE-30, Methyl silicone, SP-2100, OV-101, DB-1, etc.OV-1, SE-30, Methyl silicone, SP-2100, OV-101, DB-1, etc.OV-1, SE-30, Methyl silicone, SP-2100, OV-101, DB-1, etc.OV-1, SE-30, Methyl silicone, SP-2100, OV-101, DB-1, etc.
Column length (m) 50.50.50.50.50.
Carrier gas HydrogenHydrogenHydrogenHydrogenHydrogen
Substrate
Column diameter (mm) 0.320.320.320.320.32
Phase thickness (μm)
Program not specifiednot specifiednot specifiednot specifiednot specified
I 1162.1170.1184.1188.1189.
ReferenceWaggott and Davies, 1984Waggott and Davies, 1984Waggott and Davies, 1984Waggott and Davies, 1984Waggott and Davies, 1984
Comment MSDC-RI MSDC-RI MSDC-RI MSDC-RI MSDC-RI
Column type Other
Active phase Methyl Silicone
Column length (m)
Carrier gas
Substrate
Column diameter (mm)
Phase thickness (μm)
Program not specified
I 1186.
ReferenceArdrey and Moffat, 1981
Comment MSDC-RI

Normal alkane RI, polar column, temperature ramp

Data compiled by: NIST Mass Spectrometry Data Center, William E. Wallace, director

Column type CapillaryCapillaryCapillaryCapillaryCapillary
Active phase DB-WaxStabilwaxHP-WaxCP-Wax 52CBZB-Wax
Column length (m) 30.60.30.60.30.
Carrier gas HeliumHeliumN2HeHelium
Substrate
Column diameter (mm) 0.250.250.250.320.32
Phase thickness (μm) 0.250.250.250.50.25
Tstart (C) 40.40.50.40.40.
Tend (C) 230.240.250.220.250.
Heat rate (K/min) 3.3.5.4.5.
Initial hold (min) 2.5. 8.2.
Final hold (min) 5.10.10.20.5.
I 1712.1749.1724.1789.1698.
ReferenceZhao, Xu, et al., 2009Cros, Vandanjon, et al., 2007Fredj, Marzouk, et al., 2007Povolo, Contarini, et al., 2007N/A
Comment MSDC-RI MSDC-RI MSDC-RI MSDC-RI MSDC-RI
Column type CapillaryCapillaryCapillaryCapillaryCapillary
Active phase StabilwaxCarbowax 20MDB-WaxDB-WaxDB-Wax
Column length (m) 60.50.30.30.30.
Carrier gas HeliumHe  He
Substrate
Column diameter (mm) 0.250.250.250.250.25
Phase thickness (μm) 0.250.250.250.250.25
Tstart (C) 40.45.30.30.40.
Tend (C) 240.190.250.250.250.
Heat rate (K/min) 3.4.4.4.8.
Initial hold (min) 5.2.1.1.5.
Final hold (min) 10.50.  5.
I 1749.1769.1732.1733.1706.
ReferenceCros, Vandanjon, et al., 2003Soria, Martinez-Castro, et al., 2003Tanaka, Yamauchi, et al., 2003Tanaka, Yamauchi, et al., 2003Fu, Yoon, et al., 2002
Comment MSDC-RI MSDC-RI MSDC-RI MSDC-RI MSDC-RI
Column type CapillaryCapillaryCapillaryCapillaryCapillary
Active phase DB-WaxSupelcowax-10DB-WaxInnowaxHP-Innowax
Column length (m) 30.60.30.60.60.
Carrier gas HeliumHe HeHe
Substrate
Column diameter (mm) 0.250.250.530.250.25
Phase thickness (μm) 0.250.25 0.250.25
Tstart (C) 25.60.60.60.60.
Tend (C) 220.280.210.220.220.
Heat rate (K/min) 4.4.4.
Initial hold (min)    10.10.
Final hold (min) 30.
I 1707.1748.1755.1765.1765.
ReferenceDuque, Bonilla, et al., 2001Korány, Mednyánszky, et al., 2000Iwatsuki, Mizota, et al., 1999Kaya, Baser, et al., 1999Kaya, Baser, et al., 1999, 2
Comment MSDC-RI MSDC-RI MSDC-RI MSDC-RI MSDC-RI
Column type CapillaryCapillaryCapillaryCapillaryCapillary
Active phase CBP-20TC-WaxCarbowax 20MCarbowax 20MCarbowax 20M
Column length (m) 25.60.50.50.40.
Carrier gas   HeHe
Substrate
Column diameter (mm) 0.250.250.250.250.4
Phase thickness (μm)
Tstart (C) 35.80.60.60.50.
Tend (C) 200.240.180.180.170.
Heat rate (K/min) 5.3.2.2.4.
Initial hold (min) 5.5.4.4.10.
Final hold (min)
I 1731.1757.1698.1698.1728.
ReferenceQuiroz A. and Niemeyer H.M., 1998Shuichi, Masazumi, et al., 1996Kawakami, Kobayashi, et al., 1993Kawakami and Kobayashi, 1991Kanasawud and Crouzet, 1990
Comment MSDC-RI MSDC-RI MSDC-RI MSDC-RI MSDC-RI
Column type Capillary
Active phase DB-Wax
Column length (m) 30.
Carrier gas
Substrate
Column diameter (mm) 0.32
Phase thickness (μm)
Tstart (C) 70.
Tend (C) 200.
Heat rate (K/min) 4.
Initial hold (min) 2.
Final hold (min)
I 1745.
ReferenceWyllie, Brophy, et al., 1990
Comment MSDC-RI

Normal alkane RI, non-polar column, isothermal

Data compiled by: NIST Mass Spectrometry Data Center, William E. Wallace, director

Column type CapillaryCapillaryCapillaryCapillaryCapillary
Active phase SE-30OV-101Polidimethyl siloxanePolidimethyl siloxanePolidimethyl siloxane
Column length (m) 75.
Carrier gas He
Substrate
Column diameter (mm) 0.14
Phase thickness (μm) 0.30
Temperature (C) 120.120.130.130.130.
I 1176.1191.1182.1184.1184.
ReferenceBerezkin, Korolev, et al., 1998Nabivach and Gerasimenko, 1996Nabivach and Gerasimenko, 1996Nabivach and Gerasimenko, 1996Nabivach and Gerasimenko, 1996
Comment MSDC-RI MSDC-RI MSDC-RI MSDC-RI MSDC-RI
Column type CapillaryCapillaryCapillaryCapillaryCapillary
Active phase SqualaneSqualaneSqualaneSqualaneSqualane
Column length (m)
Carrier gas
Substrate
Column diameter (mm)
Phase thickness (μm)
Temperature (C) 120.120.120.100.100.
I 1166.1172.1173.1146.1152.
ReferenceNabivach and Gerasimenko, 1996Nabivach and Gerasimenko, 1996Nabivach and Gerasimenko, 1996Berezkin, 1993Berezkin, 1993
Comment MSDC-RI MSDC-RI MSDC-RI MSDC-RI MSDC-RI
Column type CapillaryCapillaryPackedPackedPacked
Active phase SqualaneSqualaneOV-1OV-1Polydimethyl siloxane
Column length (m) 100.100. 4.
Carrier gas N2N2NitrogenNitrogen
Substrate   Gas-Chrom QGas-Chrom Q (60-80 mesh)
Column diameter (mm) 0.250.25
Phase thickness (μm)
Temperature (C) 110.130.95.95.147.
I 1161.1173.1164.1164.1194.
ReferencePapazova and Pankova, 1975Papazova and Pankova, 1975Nicoud, Balavoine, et al., 1972Nicoud, Moradpour, et al., 1972Ferrand, 1962
Comment MSDC-RI MSDC-RI MSDC-RI MSDC-RI MSDC-RI

Van Den Dool and Kratz RI, non-polar column, temperature ramp

Data compiled by: NIST Mass Spectrometry Data Center, William E. Wallace, director

Column type CapillaryCapillaryCapillaryCapillaryCapillary
Active phase SPB-5HP-5MSHP-5MSRTX-5CP-Sil 8CB-MS
Column length (m) 60.30.30.30.0.
Carrier gas  HeHeN2He
Substrate
Column diameter (mm) 0.320.250.250.250.25
Phase thickness (μm) 1.0.250.250.250.25
Tstart (C) 40.80.60.40.40.
Tend (C) 230.300.280.300.280.
Heat rate (K/min) 3.4.4.5.4.
Initial hold (min) 2. 5.2.2.
Final hold (min) 10.  10.5.
I 1208.1190.91196.1199.21199.
ReferenceEngel and Ratel, 2007Zeng, Zhao, et al., 2007Saroglou, Dorizas, et al., 2006Ádámová, Orinák, et al., 2005Elmore, Cooper, et al., 2005
Comment MSDC-RI MSDC-RI MSDC-RI MSDC-RI MSDC-RI
Column type CapillaryCapillaryCapillaryCapillaryCapillary
Active phase DB-5PONAHP-5ZB-5HP-5
Column length (m) 30.50.30.0.30.
Carrier gas He He He
Substrate
Column diameter (mm) 0.250.20.250.320.25
Phase thickness (μm) 0.250.50.250.5
Tstart (C) 40.50.50.40.60.
Tend (C) 260. 290.265.260.
Heat rate (K/min) 2.2.4.7.3.
Initial hold (min) 5.
Final hold (min) 20.  5.
I 1177.1170.1182.1193.1180.
ReferenceSenatore, Napolitano, et al., 2005Vendeuvre, Bertoncini, et al., 2005Flach A., Dondon R.C., et al., 2004Gocmen, Gurbuz, et al., 2004Javidnia, Miri, et al., 2004
Comment MSDC-RI MSDC-RI MSDC-RI MSDC-RI MSDC-RI
Column type CapillaryCapillaryCapillaryCapillaryCapillary
Active phase HP-5MSPetrocol DHDB-5HP-5DB-5
Column length (m) 30.50.30.30.30.
Carrier gas HeHeHeN2He
Substrate
Column diameter (mm) 0.250.250.250.250.25
Phase thickness (μm) 0.250.50.250.250.25
Tstart (C) 60.35.60.60.40.
Tend (C) 280.200.240.220.310.
Heat rate (K/min) 3.3.3.5.2.
Initial hold (min)  10. 10.
Final hold (min)  10.
I 1160.1172.41181.1182.1171.5
ReferenceTzakou, Vagias, et al., 2004Censullo, Jones, et al., 2003Flamini, Luigi Cioni, et al., 2003Flamini, Luigi Cioni, et al., 2003, 2Song, Lai, et al., 2003
Comment MSDC-RI MSDC-RI MSDC-RI MSDC-RI MSDC-RI
Column type CapillaryCapillaryCapillaryCapillaryCapillary
Active phase DB-5DB-5DB-1DB-5HP-5MS
Column length (m) 30.30.30.30.30.
Carrier gas HeHeHeHeHe
Substrate
Column diameter (mm) 0.250.250.250.250.25
Phase thickness (μm) 0.250.250.251.0.25
Tstart (C) 40.40.40.50.60.
Tend (C) 310.310.325.200.275.
Heat rate (K/min) 4.6.3.2.54.
Initial hold (min)
Final hold (min)
I 1179.71183.41146.01203.21183.
ReferenceSong, Lai, et al., 2003Song, Lai, et al., 2003Sun and Stremple, 2003Xu, van Stee, et al., 2003Afsharypuor and Suleimany, 2002
Comment MSDC-RI MSDC-RI MSDC-RI MSDC-RI MSDC-RI
Column type CapillaryCapillaryCapillaryCapillaryCapillary
Active phase BPX-5HP-5MSDB-5HP-5HP-5
Column length (m) 50.30.30.30.30.
Carrier gas  HeHeN2
Substrate
Column diameter (mm) 0.320.250.250.250.25
Phase thickness (μm) 0.50.251.0.250.25
Tstart (C) 60.60.50.60.60.
Tend (C) 250.300.200.220.280.
Heat rate (K/min) 4.3.2.55.3.
Initial hold (min) 5.  10.5.
Final hold (min) 20.
I 1218.1182.1174.1180.1179.
ReferenceBredie, Mottram, et al., 2002Couladis, Chinou, et al., 2002Dallüge, van Stee, et al., 2002Flamini, Cioni, et al., 2002Fokialakis, Magiatis, et al., 2002
Comment MSDC-RI MSDC-RI MSDC-RI MSDC-RI MSDC-RI
Column type CapillaryCapillaryCapillaryCapillaryCapillary
Active phase CP Sil 8 CBHP-5HP-5HP-5SPB-Sulfur
Column length (m) 60.30.30.30.30.
Carrier gas HeHeHeHe
Substrate
Column diameter (mm) 0.250.250.250.250.32
Phase thickness (μm) 0.250.250.250.254.
Tstart (C) 40.60.60.60.40.
Tend (C) 250.280.260.380.200.
Heat rate (K/min) 4.3.3.3.4.
Initial hold (min) 8.5.  12.5
Final hold (min) 10. 10.
I 1195.1179.1179.1176.1177.3
ReferenceOruna-Concha, Ames, et al., 2002Aligiannis, Kalpoutzakis, et al., 2001Couladis, Baziou, et al., 2001Couladis, Tsortanidou, et al., 2001de Lacy Costello, Evans, et al., 2001
Comment MSDC-RI MSDC-RI MSDC-RI MSDC-RI MSDC-RI
Column type CapillaryCapillaryCapillaryCapillaryCapillary
Active phase DB-5DB-5HP-5MSOV-1OV-1
Column length (m) 30.30.30.20.20.
Carrier gas H2H2 HeHe
Substrate
Column diameter (mm) 0.320.320.250.320.32
Phase thickness (μm) 1.1.0.250.30.3
Tstart (C) 40.40.50.45.45.
Tend (C) 210.210.300.220.220.
Heat rate (K/min) 3.3.10.10.10.
Initial hold (min)    5.5.
Final hold (min)    10.10.
I 1191.1192.1191.1162.1165.
ReferenceMoio, Piombino, et al., 2000Moio, Piombino, et al., 2000Nahir, 1999Valero, Sanz, et al., 1999Valero, Sanz, et al., 1999
Comment MSDC-RI MSDC-RI MSDC-RI MSDC-RI MSDC-RI
Column type CapillaryCapillaryCapillaryCapillaryCapillary
Active phase SE-54SE-54DB-5Methyl SiliconeDB-1
Column length (m) 25.25.30. 30.
Carrier gas H2H2
Substrate
Column diameter (mm) 0.310.310.32 0.2
Phase thickness (μm)   1. 0.25
Tstart (C) 35.35.60.50.50.
Tend (C) 250.250.250.250.300.
Heat rate (K/min) 4.4.4.4.5.
Initial hold (min) 3.3.5. 2.
Final hold (min)   20. 5.
I 1189.1191.1185.1163.1148.
ReferenceLi, Wang, et al., 1998Li, Wang, et al., 1998Madruga and Mottram, 1998Analytical Methods Committee, 1997Johnson, Urso, et al., 1997
Comment MSDC-RI MSDC-RI MSDC-RI MSDC-RI MSDC-RI
Column type CapillaryCapillaryCapillaryCapillaryCapillary
Active phase OV-1DB-5DB-5DB-5DB-5
Column length (m)  30.30.30.30.
Carrier gas  H2H2HeHe
Substrate
Column diameter (mm)  0.320.320.250.25
Phase thickness (μm)  1.1.0.250.25
Tstart (C) 35.40.40.40.40.
Tend (C) 300.220.220.310.310.
Heat rate (K/min) 8.3.3.2.4.
Initial hold (min)
Final hold (min)
I 1161.61191.1192.1171.51179.7
ReferenceGautzsch and Zinn, 1996Moio L., Rillo L., et al., 1996Moio L., Rillo L., et al., 1996Lai and Song, 1995Lai and Song, 1995
Comment MSDC-RI MSDC-RI MSDC-RI MSDC-RI MSDC-RI
Column type CapillaryCapillaryCapillaryCapillaryCapillary
Active phase DB-5DB-1HP-101DB-5HP-1
Column length (m) 30.60.50.30.50.
Carrier gas HeH2N2HeHe
Substrate
Column diameter (mm) 0.250.250.250.250.32
Phase thickness (μm) 0.250.25  1.05
Tstart (C) 40.50.70.50.40.
Tend (C) 310.250.200.250.260.
Heat rate (K/min) 6.2.53.4.2.
Initial hold (min)  5.
Final hold (min)
I 1183.41141.1197.1186.1169.
ReferenceLai and Song, 1995Stashenko, Villa, et al., 1995Chung, Eiserich, et al., 1993Gómez, Ledbetter, et al., 1993Kuo and Ho, 1992
Comment MSDC-RI MSDC-RI MSDC-RI MSDC-RI MSDC-RI
Column type CapillaryCapillaryCapillaryCapillaryCapillary
Active phase Petrocol DHPetrocol DHPetrocol DHDB-5SPB-1
Column length (m) 100.100.100.0.3260.
Carrier gas HeHeHeH2He
Substrate
Column diameter (mm) 0.250.250.251.0.25
Phase thickness (μm) 0.50.50.5 0.25
Tstart (C) 30.30.30.30.35.
Tend (C) 220.220.220.180.235.
Heat rate (K/min) 1.1.1.1.52.
Initial hold (min)    5.10.
Final hold (min)     40.
I 1158.511160.261158.1194.1156.
ReferenceWhite, Douglas, et al., 1992White, Douglas, et al., 1992White, Hackett, et al., 1992Guichard and Souty, 1988Huang, Bruechert, et al., 1987
Comment MSDC-RI MSDC-RI MSDC-RI MSDC-RI MSDC-RI
Column type CapillaryCapillaryCapillaryCapillaryCapillary
Active phase SPB-1DB-5SE-54SE-54OV-1
Column length (m) 60.30.25.25.50.
Carrier gas HeHeH2H2H2
Substrate
Column diameter (mm) 0.250.260.310.310.2
Phase thickness (μm) 0.250.250.170.17
Tstart (C) 35.50.35.35.50.
Tend (C) 235.300.  200.
Heat rate (K/min) 2.6.2.2.2.
Initial hold (min) 10.4.
Final hold (min) 40.20.  55.
I 1156.1187.1165.1180.1144.
ReferenceHuang, Bruechert, et al., 1987Rostad and Pereira, 1986Weber, 1986Weber, 1986Wu and Liou, 1986
Comment MSDC-RI MSDC-RI MSDC-RI MSDC-RI MSDC-RI
Column type CapillaryCapillaryCapillaryCapillaryCapillary
Active phase Ultra-1Ultra-1Ultra-1Ultra-2Ultra-2
Column length (m) 50.50.50.50.50.
Carrier gas HeHeHeHeHe
Substrate
Column diameter (mm) 0.220.220.220.220.22
Phase thickness (μm) 0.330.330.330.330.33
Tstart (C) -30.-30.-30.-30.-30.
Tend (C) 240.240.240.240.240.
Heat rate (K/min) 1.2.3.1.2.
Initial hold (min)
Final hold (min)
I 1146.971155.821161.441178.801188.47
ReferenceHaynes and Pitzer, 1985Haynes and Pitzer, 1985Haynes and Pitzer, 1985Haynes and Pitzer, 1985Haynes and Pitzer, 1985
Comment MSDC-RI MSDC-RI MSDC-RI MSDC-RI MSDC-RI
Column type CapillaryCapillaryCapillaryCapillaryCapillary
Active phase Ultra-2SE-30SE-30OV-1OV-1
Column length (m) 50.25.25.50.25.
Carrier gas HeN2N2
Substrate
Column diameter (mm) 0.220.330.330.20.31
Phase thickness (μm) 0.33
Tstart (C) -30.100.140.35.35.
Tend (C) 240.320.320.280.280.
Heat rate (K/min) 3.10.6.
Initial hold (min)    5.5.
Final hold (min)
I 1194.631189.1199.1155.11156.84
ReferenceHaynes and Pitzer, 1985Korhonen and Lind, 1985Korhonen and Lind, 1985Knoppel, de Bortoli, et al., 1983Knoppel, de Bortoli, et al., 1983
Comment MSDC-RI MSDC-RI MSDC-RI MSDC-RI MSDC-RI
Column type CapillaryCapillaryCapillaryCapillaryCapillary
Active phase OV-1OV-1OV-101SE-52SE-52
Column length (m) 24.30.108.33.312.
Carrier gas    HeHe
Substrate
Column diameter (mm) 0.30.30.250.500.3
Phase thickness (μm) 1.11.10.2 0.34
Tstart (C) 35.35.35.50.50.
Tend (C) 250.250.200.320.250.
Heat rate (K/min) 4.4.1.6.2.
Initial hold (min) 5.5. 5.
Final hold (min)
I 1157.1157.11156.1172.1168.74
ReferenceKnoppel, de Bortoli, et al., 1982Knoppel, de Bortoli, et al., 1982Hayes and Pitzer, 1981Beernaert, 1979Lee, Vassilaros, et al., 1979
Comment MSDC-RI MSDC-RI MSDC-RI MSDC-RI MSDC-RI
Column type CapillaryPackedCapillaryCapillary
Active phase SE-52OV-101SE-52SE-52
Column length (m) 12.2.565.50.
Carrier gas He N2N2
Substrate  Gas-Chrom Q
Column diameter (mm) 0.28 0.3
Phase thickness (μm) 0.17
Tstart (C) 50.50.100.100.
Tend (C) 250.220.300.300.
Heat rate (K/min) 2.2.1.82.5
Initial hold (min)
Final hold (min)
I 1166.211162.1150.1173.
ReferenceLee, Vassilaros, et al., 1979Nixon, Wong, et al., 1979Carugno and Rossi, 1967Cantuti, Cartoni, et al., 1965
Comment MSDC-RI MSDC-RI MSDC-RI MSDC-RI

Normal alkane RI, non-polar column, temperature ramp

Data compiled by: NIST Mass Spectrometry Data Center, William E. Wallace, director

Column type CapillaryCapillaryCapillaryCapillaryCapillary
Active phase Polydimethyl siloxane: CP-Sil 5 CBHP-5 MSPetrocol DHVF-5 MSVF-5 MS
Column length (m) 60.30.100.60.60.
Carrier gas HeliumHeliumHeliumHeliumHelium
Substrate
Column diameter (mm) 0.250.250.250.320.32
Phase thickness (μm) 1.00.250.500.250.25
Tstart (C) 45.35.20.30.30.
Tend (C) 210.300.220.260.260.
Heat rate (K/min) 3.63.15.2.2.
Initial hold (min) 1.455.15.
Final hold (min) 2.7215.30.28.28.
I 1173.1176.1181.1186.1188.
ReferenceBramston-Cook, 2013Kotowska, Zalikowski, et al., 2012Supelco, 2012Leffingwell and Alford, 2011Leffingwell and Alford, 2011
Comment MSDC-RI MSDC-RI MSDC-RI MSDC-RI MSDC-RI
Column type CapillaryCapillaryCapillaryCapillaryCapillary
Active phase HP-5 MSHP-5 MSHP-5 MSHP-5HP-5 MS
Column length (m) 30.30.30.30.30.
Carrier gas HeliumHeliumHeliumHydrogenHelium
Substrate
Column diameter (mm) 0.250.250.250.250.25
Phase thickness (μm) 0.250.250.250.250.25
Tstart (C) 70.60.70.70.35.
Tend (C) 290.220.290.290.195.
Heat rate (K/min) 5.5.5.5.2.
Initial hold (min)  10.  5.
Final hold (min)   10. 30.
I 1187.1181.1190.1191.1174.
ReferenceLazarevic, Radulovic, et al., 2010Ogunwande, Flamini, et al., 2010Radulovic, Blagojevic, et al., 2010Radulovic, Dordevic, et al., 2010Kim and Chung, 2009
Comment MSDC-RI MSDC-RI MSDC-RI MSDC-RI MSDC-RI
Column type CapillaryCapillaryCapillaryCapillaryCapillary
Active phase PONAHP-5 MSDB-5 MSOV-1Ultra-2
Column length (m) 50.30.30.30.50.
Carrier gas Nitrogen HeliumNitrogenHe
Substrate
Column diameter (mm) 0.200.250.250.250.25
Phase thickness (μm) 0.50 0.25 0.32
Tstart (C) 35.60.50.60.50.
Tend (C) 200.280.300.290.270.
Heat rate (K/min) 2.3.5.4.2.
Initial hold (min) 15. 5.
Final hold (min) 10. 5.
I 1178.1179.1178.1168.1196.
ReferenceZhang, Ding, et al., 2009Baziou, Couladis, et al., 2008Noudogbessi, Yedomonhan, et al., 2008Asif and Fazeelat, 2006Schlumpberger B.O., Clery R.A., et al., 2006
Comment MSDC-RI MSDC-RI MSDC-RI MSDC-RI MSDC-RI
Column type CapillaryCapillaryCapillaryCapillaryCapillary
Active phase DB-1DB-1HP-5DB-5HP-5
Column length (m) 60.60.60.30.30.
Carrier gas HeHeHeHeHelium
Substrate
Column diameter (mm) 0.320.320.320.250.32
Phase thickness (μm) 0.250.250.250.250.25
Tstart (C) 35.35.30.40.40.
Tend (C) 230.230.260.260.250.
Heat rate (K/min) 2.2.2.2.5.
Initial hold (min) 4.4.2.5.2.
Final hold (min) 25.25.28.20.5.
I 1153.1157.1182.61180.1160.
ReferenceLee, Lee, et al., 2005Lee, Lee, et al., 2005Leffingwell and Alford, 2005Senatore, Apostolides Arnold, et al., 2005N/A
Comment MSDC-RI MSDC-RI MSDC-RI MSDC-RI MSDC-RI
Column type CapillaryCapillaryCapillaryCapillaryCapillary
Active phase 5 % Phenyl methyl siloxaneSPB-5DB-5HP-5DB-5MS
Column length (m) 0.60.30.30.30.
Carrier gas HeHeliumHeHeHe
Substrate
Column diameter (mm) 0.250.320.250.250.25
Phase thickness (μm) 1.1.00.250.250.25
Tstart (C) 40.30.60.60.60.
Tend (C) 250.230.240.275.270.
Heat rate (K/min) 7.3.3.4.3.
Initial hold (min) 10.
Final hold (min) 5.
I 1186.1208.1182.1177.1181.
ReferenceRamírez, Estévez, et al., 2004Sebastian, Viallon-Fernandez, et al., 2003Flamini, Ertugrul, et al., 2002Ghannadi, Sajjadi, et al., 2002Zoghbi, Andrade, et al., 2002
Comment MSDC-RI MSDC-RI MSDC-RI MSDC-RI MSDC-RI
Column type CapillaryCapillaryCapillaryCapillaryCapillary
Active phase DB-5Optima-1HP-5OV-1OV-1
Column length (m) 30.25.30.
Carrier gas HeHeH2H2H2
Substrate
Column diameter (mm) 0.250.200.25
Phase thickness (μm) 0.250.250.250.250.25
Tstart (C) 60.50.40.80.100.
Tend (C) 240.250.280.275.275.
Heat rate (K/min) 3.3.3.5.4.
Initial hold (min)  3.10.
Final hold (min)   10.
I 1178.1165.1175.1150.1159.
ReferenceZoghbi, Andrade, et al., 2002, 2de Beck, Bessière, et al., 2000Bicalho, Pereira, et al., 2000Dumitrescu, Buda, et al., 2000Dumitrescu, Buda, et al., 2000
Comment MSDC-RI MSDC-RI MSDC-RI MSDC-RI MSDC-RI
Column type CapillaryCapillaryCapillaryCapillaryCapillary
Active phase C103H208C103H208BP-1HP-5HP-5
Column length (m)   50.30.30.
Carrier gas H2H2He
Substrate
Column diameter (mm)   0.220.320.32
Phase thickness (μm) 0.250.250.750.250.25
Tstart (C) 80.100.50.50.50.
Tend (C) 275.275.200.310.310.
Heat rate (K/min) 5.4.5.5.5.
Initial hold (min)    2.2.
Final hold (min)
I 1192.1200.1196.1183.1183.
ReferenceDumitrescu, Buda, et al., 2000Dumitrescu, Buda, et al., 2000Health Safety Executive, 2000Miao and Wu, 1999Miao and Wu, 1999
Comment MSDC-RI MSDC-RI MSDC-RI MSDC-RI MSDC-RI
Column type CapillaryCapillaryCapillaryCapillaryCapillary
Active phase HP-5HP-5HP-5HP-5HP-5
Column length (m) 30.30.30.30.30.
Carrier gas
Substrate
Column diameter (mm) 0.320.320.320.320.32
Phase thickness (μm) 0.250.250.250.250.25
Tstart (C) 50.50.50.50.50.
Tend (C) 310.310.310.310.310.
Heat rate (K/min) 5.5.5.5.5.
Initial hold (min) 2.2.2.2.2.
Final hold (min)
I 1184.1184.1184.1184.1186.
ReferenceMiao and Wu, 1999Miao and Wu, 1999Miao and Wu, 1999Miao and Wu, 1999Miao and Wu, 1999
Comment MSDC-RI MSDC-RI MSDC-RI MSDC-RI MSDC-RI
Column type CapillaryCapillaryCapillaryCapillaryCapillary
Active phase HP-5OV-1HP-5DB-5HP-1
Column length (m) 30. 50.30.25.
Carrier gas    He
Substrate
Column diameter (mm) 0.32 0.320.250.2
Phase thickness (μm) 0.25 0.520.25
Tstart (C) 50.50.35.60.35.
Tend (C) 310.160.250.240.200.
Heat rate (K/min) 5.2.2.3.5.
Initial hold (min) 2. 15. 5.
Final hold (min)   45.
I 1187.1158.1177.1177.1159.
ReferenceMiao and Wu, 1999Orav, Kailas, et al., 1999Boylston and Viniyard, 1998El-Sakhawy, El-Tantawy, et al., 1998Quiroz A. and Niemeyer H.M., 1998
Comment MSDC-RI MSDC-RI MSDC-RI MSDC-RI MSDC-RI
Column type CapillaryCapillaryCapillaryCapillaryCapillary
Active phase Ultra-1SPB-1PB-1DB-5DB-5 MS
Column length (m) 50.50.50.30.30.
Carrier gas H2HeH2H2Helium
Substrate
Column diameter (mm) 0.20.20.320.320.25
Phase thickness (μm) 0.330.330.20.25
Tstart (C) 60.40.80.80.50.
Tend (C) 300.200.270.270.250.
Heat rate (K/min) 3.3.4.4.4.
Initial hold (min)  3.2.2.
Final hold (min) 35.30.5.5.
I 1164.1156.1164.1164.1186.
ReferenceElizalde-González, Hutfliess, et al., 1996Wong and Lai, 1996Andersson and Weis, 1994Andersson and Weis, 1994Gomez and Ledbetter, 1994
Comment MSDC-RI MSDC-RI MSDC-RI MSDC-RI MSDC-RI
Column type CapillaryCapillaryCapillaryCapillaryCapillary
Active phase DB-5DB-5DB-5DB-1Ultra-1
Column length (m) 30.30.30.60.25.
Carrier gas  H2H2HeHe
Substrate
Column diameter (mm) 0.250.320.320.320.32
Phase thickness (μm) 0.2411.1.1.20.25
Tstart (C) 60.40.40.30.80.
Tend (C) 160.220.220.240.260.
Heat rate (K/min) 4.3.3.3.3.
Initial hold (min) 2.  10.
Final hold (min)
I 1187.871191.1192.1180.1154.
ReferenceKim, Kim, et al., 1993Moio, Dekimpe, et al., 1993Moio, Dekimpe, et al., 1993Ciccioli, Cecinato, et al., 1992Okumura, 1991
Comment MSDC-RI MSDC-RI MSDC-RI MSDC-RI MSDC-RI
Column type CapillaryCapillaryCapillaryCapillaryCapillary
Active phase SE-30OV-101OV-101SE-54DB-1
Column length (m) 10.54.54.25.50.
Carrier gas  HeliumHeliumHe
Substrate
Column diameter (mm) 0.250.260.260.320.32
Phase thickness (μm)
Tstart (C) 20.75.75.50.0.
Tend (C) 200.220.220.250.250.
Heat rate (K/min) 4.6.6.8.3.
Initial hold (min)  0.0.2.
Final hold (min)  0.0.12.
I 1142.1170.1173.1176.1155.
ReferenceYaacob, Abdullah, et al., 1989Zenkevich and Tsibulskaya, 1989Zenkevich and Tsibulskaya, 1989Harland, Cumming, et al., 1986Habu, Flath, et al., 1985
Comment MSDC-RI MSDC-RI MSDC-RI MSDC-RI MSDC-RI
Column type CapillaryCapillaryCapillaryCapillaryCapillary
Active phase DB-1OV-101OV-101DB-1SE-30
Column length (m) 50.50.50.60.50.
Carrier gas   He
Substrate
Column diameter (mm) 0.320.320.310.320.5
Phase thickness (μm)
Tstart (C) 50.50.0.50.40.
Tend (C) 250.225.225.250.170.
Heat rate (K/min) 3.4.3.4.3.
Initial hold (min)  0.11.0.13.
Final hold (min)  30. 5.
I 1153.1159.1147.1155.1163.
ReferenceHabu, Flath, et al., 1985Stern, Flath, et al., 1985del Rosario, de Lumen, et al., 1984Flath, Mon, et al., 1983Heydanek and McGorrin, 1981
Comment MSDC-RI MSDC-RI MSDC-RI MSDC-RI MSDC-RI
Column type Capillary
Active phase SE-30
Column length (m) 50.
Carrier gas He
Substrate
Column diameter (mm) 0.5
Phase thickness (μm)
Tstart (C) 40.
Tend (C) 170.
Heat rate (K/min) 3.
Initial hold (min) 3.
Final hold (min)
I 1162.
ReferenceHeydanek and McGorrin, 1981, 2
Comment MSDC-RI

References

Thermodynamics Research Center, 1997
Thermodynamics Research Center,
Selected Values of Properties of Chemical Compounds., Thermodynamics Research Center, Texas A&M University, College Station, Texas, 1997. [all data]
Dorofeeva O.V., 1986
Dorofeeva O.V.,
On calculation of thermodynamic properties of polycyclic aromatic hydrocarbons,
Thermochim. Acta, 1986, 102, 59-66. [all data]
Dorofeeva O.V., 1988
Dorofeeva O.V.,
Thermodynamic Properties of Polycyclic Aromatic Hydrocarbons in the Gaseous Phase. Institute for High Temperatures, USSR Academy of Sciences, Preprint No.1-238 (in Russian), Moscow, 1988. [all data]
Barrow G.M., 1951
Barrow G.M.,
The thermodynamic properties of naphthalene,
J. Am. Chem. Soc., 1951, 73, 573-575. [all data]
McClellan A.L., 1955
McClellan A.L.,
Vibrational assignment and thermodynamic properties of naphthalene,
J. Chem. Phys., 1955, 23, 245-248. [all data]
Lielmezs J., 1981
Lielmezs J., Jr.,
Thermodynamic functions for naphthalene,
Thermochim. Acta, 1981, 47, 287-308. [all data]
Tsonopoulos and Ambrose, 1995
Tsonopoulos, C.; Ambrose, D.,
Vapor-Liquid Critical Properties of Elements and Compounds. 3. Aromatic Hydrocarbons,
J. Chem. Eng. Data, 1995, 40, 547-558. [all data]
Cheng, 1963
Cheng, D.C.H.,
Critical temperatures and volumes of some binary systems,
Chem. Eng. Sci., 1963, 18, 715. [all data]
Chirico, Knipmeyer, et al., 1993
Chirico, R.D.; Knipmeyer, S.E.; Nguyen, A.; Steele, W.V.,
The thermodynamic properties to the temperature 700 K of naphthalene and of 2,7-dimethylnaphthalene,
J. Chem. Thermodyn., 1993, 25, 1461-94. [all data]
Schroeer, 1941
Schroeer, E.,
Critical State VI. Vapor-pressure Curve of Naphthalene Up To the Critical Point,
Z. Phys. Chem., Abt. B, 1941, 49, 271-8. [all data]
Zhuravlev, 1937
Zhuravlev, D.I.,
Crit. Temp. and Orthobaric Density of Diphenyl Ether and Napphthalene naphthalene,
Zh. Fiz. Khim., 1937, 9, 875. [all data]
Zhao, Unhannanant, et al., 2008
Zhao, Hui; Unhannanant, Patamaporn; Hanshaw, William; Chickos, James S.,
Enthalpies of Vaporization and Vapor Pressures of Some Deuterated Hydrocarbons. Liquid-Vapor Pressure Isotope Effects,
J. Chem. Eng. Data, 2008, 53, 7, 1545-1556, https://doi.org/10.1021/je800091s
. [all data]
Haftka, Parsons, et al., 2006
Haftka, Joris J.H.; Parsons, John R.; Govers, Harrie A.J.,
Supercooled liquid vapour pressures and related thermodynamic properties of polycyclic aromatic hydrocarbons determined by gas chromatography,
Journal of Chromatography A, 2006, 1135, 1, 91-100, https://doi.org/10.1016/j.chroma.2006.09.050
. [all data]
Chickos, Hesse, et al., 1998
Chickos, James; Hesse, Donald; Hosseini, Sarah; Nichols, Gary; Webb, Paul,
Sublimation enthalpies at 298.15K using correlation gas chromatography and differential scanning calorimetry measurements,
Thermochimica Acta, 1998, 313, 2, 101-110, https://doi.org/10.1016/S0040-6031(97)00432-2
. [all data]
Chickos, Hosseini, et al., 1995
Chickos, James S.; Hosseini, Sarah; Hesse, Donald G.,
Determination of vaporization enthalpies of simple organic molecules by correlations of changes in gas chromatographic net retention times,
Thermochimica Acta, 1995, 249, 41-62, https://doi.org/10.1016/0040-6031(95)90670-3
. [all data]
Torres-Gomez, Barreiro-Rodriguez, et al., 1988
Torres-Gomez, L.A.; Barreiro-Rodriguez, G.; Galarza-Mondragon, A.,
A new method for the measurement of enthalpies of sublimation using differential scanning calorimetry,
Thermochim. Acta, 1988, 124, 229-233. [all data]
Lei, Chankalal, et al., 2002
Lei, Ying Duan; Chankalal, Raymond; Chan, Anita; Wania, Frank,
Supercooled Liquid Vapor Pressures of the Polycyclic Aromatic Hydrocarbons,
J. Chem. Eng. Data, 2002, 47, 4, 801-806, https://doi.org/10.1021/je0155148
. [all data]
Boller and Wiedemann, 1998
Boller, A.; Wiedemann, H.G.,
Journal of Thermal Analysis and Calorimetry, 1998, 53, 2, 431-439, https://doi.org/10.1023/A:1010133106907
. [all data]
Back, Grzyll, et al., 1996
Back, Dwight D.; Grzyll, Lawrence R.; Corrigan, Mary,
DSC enthalpy of vaporization measurements of high temperature two-phase working fluids,
Thermochimica Acta, 1996, 272, 53-63, https://doi.org/10.1016/0040-6031(95)02615-0
. [all data]
Chirico, Knipmeyer, et al., 1993, 2
Chirico, R.D.; Knipmeyer, S.E.; Nguyen, A.; Steele, W.V.,
The thermodynamic properties to the temperature 700 K of naphthalene and of 2,7-dimethylnaphthalene,
J. Chem. Thermodyn., 1993, 25, 1461-1494. [all data]
Lee and Holder, 1993
Lee, Chang Ha; Holder, Gerald D.,
Vapor-liquid equilibria in the systems toluene/naphthalene and cyclohexane/naphthalene,
J. Chem. Eng. Data, 1993, 38, 2, 320-323, https://doi.org/10.1021/je00010a034
. [all data]
Ambrose, Ewing, et al., 1990
Ambrose, D.; Ewing, M.B.; Ghiassee, N.B.; Sanchez Ochoa, J.C.,
The ebulliometric method of vapour-pressure measurement: vapour pressures of benzene, hexafluorobenzene, and naphthalene,
The Journal of Chemical Thermodynamics, 1990, 22, 6, 589-605, https://doi.org/10.1016/0021-9614(90)90151-F
. [all data]
Stephenson and Malanowski, 1987
Stephenson, Richard M.; Malanowski, Stanislaw,
Handbook of the Thermodynamics of Organic Compounds, 1987, https://doi.org/10.1007/978-94-009-3173-2
. [all data]
de Kruif, Kuipers, et al., 1981
de Kruif, C.G.; Kuipers, T.; van Miltenburg, J.C.; Schaake, R.C.F.; Stevens, G.,
The vapour pressure of solid and liquid naphthalene,
The Journal of Chemical Thermodynamics, 1981, 13, 11, 1081-1086, https://doi.org/10.1016/0021-9614(81)90006-9
. [all data]
Wilson, Johnston, et al., 1981
Wilson, Grant M.; Johnston, Robert H.; Hwang, Shuen-Cheng.; Tsonopoulos, Constantine.,
Volatility of coal liquids at high temperatures and pressures,
Ind. Eng. Chem. Proc. Des. Dev., 1981, 20, 1, 94-104, https://doi.org/10.1021/i200012a015
. [all data]
Fowler, Trump, et al., 1968
Fowler, Lewis.; Trump, Walter N.; Vogler, Carl E.,
Vapor pressure of naphthalene. Measurements between 40.deg. and 180.deg.,
J. Chem. Eng. Data, 1968, 13, 2, 209-210, https://doi.org/10.1021/je60037a020
. [all data]
Camin and Rossini, 1955
Camin, David L.; Rossini, Frederick D.,
Physical Properties of Fourteen API Research Hydrocarbons, C 9 to C 15,
J. Phys. Chem., 1955, 59, 11, 1173-1179, https://doi.org/10.1021/j150533a014
. [all data]
Barrow and McClellan, 1951
Barrow, Gordon M.; McClellan, A.L.,
The Thermodynamic Properties of Naphthalene,
J. Am. Chem. Soc., 1951, 73, 2, 573-575, https://doi.org/10.1021/ja01146a020
. [all data]
Cramer, 1943
Cramer, K.S.N.,
Chem. Zentr. II, 1943, 2234. [all data]
Mortimer and Murphy, 1923
Mortimer, F. Spencer.; Murphy, Ray v.,
The Vapor Pressures of Some Substances Found in Coal Tar.,
Ind. Eng. Chem., 1923, 15, 11, 1140-1142, https://doi.org/10.1021/ie50167a012
. [all data]
NELSON and SENSEMAN, 1922
NELSON, O.A.; SENSEMAN, C.E.,
Vapor Pressure Determinations on Naphthalene, Anthracene, Phecanthrene, and Anthraquinone between Their Melting and Boiling Points,
J. Ind. Eng. Chem., 1922, 14, 1, 58-62, https://doi.org/10.1021/ie50145a028
. [all data]
Grayson and Fosbraey, 2006
Grayson, B. Terence; Fosbraey, Lynda A.,
Determination of the vapour pressure of pesticides,
Pestic. Sci., 2006, 13, 3, 269-278, https://doi.org/10.1002/ps.2780130308
. [all data]
McEachern and Sandoval, 2001
McEachern, D.M.; Sandoval, O.,
A molecular flow evaporation apparatus for measuring vapour pressures and heats of sublimation of organic compounds,
J. Phys. E: Sci. Instrum., 2001, 6, 2, 155-161, https://doi.org/10.1088/0022-3735/6/2/026
. [all data]
Nass, Lenoir, et al., 1995
Nass, Karen; Lenoir, Dieter; Kettrup, Antonius,
Calculation of the Thermodynamic Properties of Polycyclic Aromatic Hydrocarbons by an Incremental Procedure,
Angew. Chem. Int. Ed. Engl., 1995, 34, 16, 1735-1736, https://doi.org/10.1002/anie.199517351
. [all data]
Wania, Shiu, et al., 1994
Wania, Frank; Shiu, Wan-Ying; Mackay, Donald,
Measurement of the Vapor Pressure of Several Low-Volatility Organochlorine Chemicals at Low Temperatures with a Gas Saturation Method,
J. Chem. Eng. Data, 1994, 39, 3, 572-577, https://doi.org/10.1021/je00015a039
. [all data]
Khudyakov, 1988
Khudyakov, V.L.,
Russ. J. Phys. Chem., 1988, 62, 1743. [all data]
SATO, INOMATA, et al., 1986
SATO, NOBUYUKI; INOMATA, HIROSHI; ARAI, KUNIO; SAITO, SHOZABURO,
Measurement of vapor pressures for coal-related aromatic compounds by gas saturation method.,
J. Chem. Eng. Japan / JCEJ, 1986, 19, 2, 145-147, https://doi.org/10.1252/jcej.19.145
. [all data]
Glukhova, Arkhangelova, et al., 1985
Glukhova, O.T.; Arkhangelova, N.M.; Teplitsky, A.B.; Sukhodub, L.F.; Yanson, I.K.; Kaminski, Miron,
The low-temperature quartz resonator method for determination of the enthalpy of sublimation,
Thermochimica Acta, 1985, 95, 1, 133-138, https://doi.org/10.1016/0040-6031(85)80041-1
. [all data]
Matsubara and Kuwamoto, 1985
Matsubara, Norio; Kuwamoto, Tooru,
Vapor pressure measurements in carrier gas containing ligand vapor using the transpiration technique,
Thermochimica Acta, 1985, 83, 2, 193-202, https://doi.org/10.1016/0040-6031(85)87003-9
. [all data]
Sonnefeld, Zoller, et al., 1983
Sonnefeld, W.J.; Zoller, W.H.; May, W.E.,
Dynamic coupled-column liquid-chromatographic determination of ambient-temperature vapor pressures of polynuclear aromatic hydrocarbons,
Anal. Chem., 1983, 55, 2, 275-280, https://doi.org/10.1021/ac00253a022
. [all data]
Colomina, Jimenez, et al., 1982
Colomina, M.; Jimenez, P.; Turrion, C.,
Vapour pressures and enthalpies of sublimation of naphthalene and benzoic acid,
J. Chem. Thermodyn., 1982, 14, 779-784. [all data]
Kruif, 1980
Kruif, C.G.,
Enthalpies of sublimation and vapour pressures of 11 polycyclic hydrocarbons,
J. Chem. Thermodyn., 1980, 12, 243-248. [all data]
Murray, Cavell, et al., 1980
Murray, J.P.; Cavell, K.J.; Hill, J.O.,
A DSC study of benzoic acid: a suggested calibrant compound,
Thermochimica Acta, 1980, 36, 1, 97-101, https://doi.org/10.1016/0040-6031(80)80114-6
. [all data]
Macknick and Prausnitz, 1979
Macknick, A. Brian; Prausnitz, John M.,
Vapor pressures of high-molecular-weight hydrocarbons,
J. Chem. Eng. Data, 1979, 24, 3, 175-178, https://doi.org/10.1021/je60082a012
. [all data]
De Kruif and Van Ginkel, 1977
De Kruif, C.G.; Van Ginkel, C.H.D.,
Torsion-weighing effusion vapour-pressure measurements on organic compounds,
The Journal of Chemical Thermodynamics, 1977, 9, 8, 725-730, https://doi.org/10.1016/0021-9614(77)90015-5
. [all data]
Ambrose, Lawrenson, et al., 1975
Ambrose, D.; Lawrenson, I.J.; Sprake, C.H.S.,
The vapour pressure of naphthalene,
The Journal of Chemical Thermodynamics, 1975, 7, 12, 1173-1176, https://doi.org/10.1016/0021-9614(75)90038-5
. [all data]
Chickos, 1975
Chickos, James Speros,
A simple equilibrium method for determining heats of sublimation,
J. Chem. Educ., 1975, 52, 2, 134-39, https://doi.org/10.1021/ed052p134
. [all data]
McEachern, Sandoval, et al., 1975
McEachern, D.M.; Sandoval, O.; Iniguez, J.C.,
Vapor pressures, derived enthalpies of sublimation, enthalpies of fusion, and resonance energies of acridine and phenazine,
J. Chem. Thermodyn., 1975, 7, 299-306. [all data]
Radchenko and Kitaigorodskii, 1974
Radchenko, L.G.; Kitaigorodskii, A.I.,
The vapour pressures and heats of sublimation of naphthalene, biphenyl, octafluoronaphthalene, decafluorobiphenyl, acenaphthene and α-nitronaphthalene,
Russ. J. Phys. Chem. (Engl. Transl.), 1974, 48, 1595. [all data]
Radchenko, 1971
Radchenko, L.G.,
Zh. Fiz. Khim., 1971, 45, 5, 1310. [all data]
Karyakin, Rabinovich, et al., 1968
Karyakin, N.V.; Rabinovich, I.B.; Pakhomov, L.G.,
Heats of sublimation of naphthalene and its monosubstituted β-derivatives,
Russ. J. Phys. Chem. (Engl. Transl.), 1968, 42, 954. [all data]
Miller, 1963
Miller, George A.,
Vapor Pressure of Naphthalene. Thermodynamic Consistency with Proposed Frequency Assignments.,
J. Chem. Eng. Data, 1963, 8, 1, 69-72, https://doi.org/10.1021/je60016a019
. [all data]
Cox and Pilcher, 1970
Cox, J.D.; Pilcher, G.,
Thermochemistry of Organic and Organometallic Compounds, Academic Press Inc., London, 1970, 643. [all data]
Aihara, 1959
Aihara, A.,
Estimation of the energy of hydrogen bonds formed in crystals. I. Sublimation pressures of some organic molecular crystals and the additivity of lattice energy,
Bull. Chem. Soc. Jpn., 1959, 32, 1242. [all data]
Aihara, 1959, 2
Aihara, Ariyuki,
Estimation of the Energy of Hydrogen Bonds Formed in Crystals. I. Sublimation Pressures of Some Organic Molecular Crystals and the Additivity of Lattice Energy,
Bull. Chem. Soc. Jpn., 1959, 32, 11, 1242-1248, https://doi.org/10.1246/bcsj.32.1242
. [all data]
Hoyer and Peperle, 1958
Hoyer, H.; Peperle, W.,
Z. Elektrochem., 1958, 62, 61. [all data]
Sklyarenko, Markin, et al., 1958
Sklyarenko, S.I.; Markin, B.I.; Belyaeva, L.B.,
Zh. Fiz. Khim., 1958, 32, 1916. [all data]
Sherwood and Bryant, 1957
Sherwood, T.K.; Bryant, J.H., Jr.,
Can. J. Chem. Eng., 1957, 35, 51. [all data]
Bradley and Cleasby, 1953
Bradley, R.S.; Cleasby, T.G.,
346. The vapour pressure and lattice energy of hydrogen-bonded crystals. Part I. Oxamide, oxamic acid, and rubeanic acid,
J. Chem. Soc., 1953, 1681, https://doi.org/10.1039/jr9530001681
. [all data]
Jones, 1960
Jones, A.H.,
Sublimation Pressure Data for Organic Compounds.,
J. Chem. Eng. Data, 1960, 5, 2, 196-200, https://doi.org/10.1021/je60006a019
. [all data]
Sears and Hopke, 1954
Sears, G.W.; Hopke, E.R.,
The Vapor Pressure of Naphthalene,
J. Am. Chem. Soc., 1954, 76, 7, 2026-2026, https://doi.org/10.1021/ja01636a099
. [all data]
Bradley and Cleasby, 1953, 2
Bradley, R.S.; Cleasby, T.G.,
The vapour pressure and lattice energy of some aromatic ring compounds,
J. Am. Chem. Soc., 1953, 1690-16. [all data]
Zibberman-Granovskaya, 1940
Zibberman-Granovskaya, A.A.,
Russ. J. Phys. Chem., 1940, 14, 759. [all data]
Andrews, 1925
Andrews, Mary R.,
Vapor Pressure of Naphthalene at Low Temperatures,
J. Phys. Chem., 1925, 30, 11, 1497-1500, https://doi.org/10.1021/j150269a005
. [all data]
Swan and Mack, 1925
Swan, Thomas H.; Mack, Edward,
VAPOR PRESSURES OF ORGANIC CRYSTALS BY AN EFFUSION METHOD,
J. Am. Chem. Soc., 1925, 47, 8, 2112-2116, https://doi.org/10.1021/ja01685a005
. [all data]
Mastrangelo, 1957
Mastrangelo, S.V.R.,
Adiabatic calorimeter for determination of cryoscopic data,
Anal. Chem., 1957, 29(5), 841-845. [all data]
McCullough, Finke, et al., 1957
McCullough, J.P.; Finke, H.L.; Messerly, J.F.; Kincheloe, T.C.; Waddington, G.,
The low temperature thermodynamic properties of naphthalene, 1-methylnaphthalene, 2-methylnaphthalene, 1,2,3,4-tetrahydronaphthalene, trans-decahydronaphthalene and cis-decahydronaphthalene,
J. Phys. Chem., 1957, 61, 1105-1116. [all data]
Spaght, Thomas, et al., 1932
Spaght, M.E.; Thomas, S.B.; Parks, G.S.,
Some heat capacity data on organic compounds obtained with a radiation calorimeter,
J. Phys. Chem., 1932, 36, 882-888. [all data]
Sharma, Gupta, et al., 2008
Sharma, B.L.; Gupta, S.; Tandon, S.; Kant, R.,
Physico-mechanical properties of naphthalene--acenaphthene eutectic system by different modes of solidification,
Materials Chemistry and Physics, 2008, 111, 2-3, 423-430, https://doi.org/10.1016/j.matchemphys.2008.04.049
. [all data]
Hafsaoui and Mahmoud, 2007
Hafsaoui, S.L.; Mahmoud, R.,
Solid-liquid equilibria of binary systems containing n-tetracosane with naphthalene or dibenzofuran,
J Therm Anal Calorim, 2007, 88, 2, 565-570, https://doi.org/10.1007/s10973-006-8084-2
. [all data]
Khimeche and Dahmani, 2006
Khimeche, Kamel; Dahmani, Abdallah,
Solid-Liquid Equilibria of Naphthalene + Alkanediamine Mixtures,
J. Chem. Eng. Data, 2006, 51, 2, 382-385, https://doi.org/10.1021/je0502851
. [all data]
Khimeche and Dahmani, 2006, 2
Khimeche, K.; Dahmani, A.,
Determination by DSC of solid--liquid diagrams for polyaromatic -- 4,4'diaminodiphenylmethane binary systems,
J Therm Anal Calorim, 2006, 84, 1, 47-52, https://doi.org/10.1007/s10973-005-7167-9
. [all data]
Chirico, Knipmeyer, et al., 2002
Chirico, R.D.; Knipmeyer, S.E.; Steele, W.V.,
Heat capacities, enthalpy increments, and derived thermodynamic functions for naphthalene between the temperatures 5K and 440K,
The Journal of Chemical Thermodynamics, 2002, 34, 11, 1873-1884, https://doi.org/10.1016/S0021-9614(02)00262-8
. [all data]
Acree, 1991
Acree, William E.,
Thermodynamic properties of organic compounds: enthalpy of fusion and melting point temperature compilation,
Thermochimica Acta, 1991, 189, 1, 37-56, https://doi.org/10.1016/0040-6031(91)87098-H
. [all data]
Syunyaev, Tumanyan, et al., 1984
Syunyaev, Z.I.; Tumanyan, B.P.; Kolesnikov, S.I.; Zhokhova, N.I.,
Some anomalies in melting points of binary mixtures of solid hydrocarbons,
Zhur. Prikl. Khim. (Leningrad), 1984, 57, 666-669. [all data]
Rastogi and Bassi, 1964
Rastogi, R.P.; Bassi, P.S.,
Mechanism of eutectic crystallization,
J. Phys. Chem., 1964, 68, 2398-2406. [all data]
Ueberreiter and Orthmann, 1950
Ueberreiter, K.; Orthmann, H.-J.,
Specifische Wärme, spezifisches Volumen, Temperatur- und Wärme-leittähigkeit einiger disubstituierter Benzole und polycyclischer Systeme,
Z. Natursforsch. 5a, 1950, 101-108. [all data]
Eibert, 1944
Eibert, J.,
Thesis Washington University (St. Louis), 1944. [all data]
Schmidt, 1941
Schmidt, W.R.,
Thesis Washington University (St. Louis), 1941. [all data]
Andrews, Lynn, et al., 1926
Andrews, D.H.; Lynn, G.; Johnston, J.,
The heat capacities and heat of crystallization of some isomeric aromatic compounds,
J. Am. Chem. Soc., 1926, 48, 1274-1287. [all data]
David, 1964
David, D.J.,
Determination of specific heat and heat of fusion by differential thermal analysis. Study of theory and operating parameters,
Anal. Chem., 1964, 36, 2162-2166. [all data]
Andon and Connett, 1980
Andon, R.J.L.; Connett, J.E.,
Calibrants for thermal analysis. Measurement of their enthalpies of fusion by adiabatic calorimetry,
Thermochim. Acta, 1980, 42, 241-247. [all data]
Radomska and Radomski, 1980
Radomska, M.; Radomski, R.,
Calorimetric studies of binary systems of 1,3,5-trinitrobenzene with naphthalene, anthracene, and carbazole. I. Phase transitions and heat capacities of the pure components and charge-transfer complexes,
Thermochim. Acta, 1980, 40, 405-414. [all data]
Mackay, Shiu, et al., 1979
Mackay, D.; Shiu, W.-Y.; Sutherland, R.P.,
Determination of Air-Water Henry's Law Constants for Hydrophobic Pollutants,
Environ. Sci. Technol., 1979, 13, 333-337. [all data]
Bohon and Claussen, 1951
Bohon, R.L.; Claussen, W.F.,
The solubility of aromatic hydrocarbons in water,
J. Am. Chem. Soc., 1951, 73, 1571-1578. [all data]