quinoline, 5-amino-2,6-dichloro-8-ethyl-

Phase change data

Data compiled by: Thermodynamics Research Center, NIST Boulder Laboratories, Chris Muzny director

Quantity Value Units Method Reference Comment
Tfus397.15KN/ACrawford and Capps, 1963Uncertainty assigned by TRC = 1. K

In addition to the Thermodynamics Research Center (TRC) data available from this site, much more physical and chemical property data is available from the following TRC products:

References

Crawford and Capps, 1963
Crawford, R.H.; Capps, J.D., 6-Chloro-8-Ethylquinoline and Some Derivatives, J. Chem. Eng. Data, 1963, 8, 120. [all data]