o-Divinylbenzene
- Formula: C10H10
- Molecular weight: 130.1864
- IUPAC Standard InChIKey: MYRTYDVEIRVNKP-UHFFFAOYSA-N
- CAS Registry Number: 91-14-5
- Chemical structure:
View 3d structure (requires JavaScript / HTML 5) - Other names: 1,2-divinylbenzene; 1,2-diethenylbenzene

Kovats' RI, non-polar column, isothermal

Column type | Active phase | Temperature (C) | I | Reference | Comment |
---|---|---|---|---|---|
Capillary | SE-30 | 80. | 1102. | Bredael, 1982 | Column length: 100. m; Column diameter: 0.5 mm |

References

Bredael, 1982
Bredael, P.,
Retention indices of hydrocarbons on SE-30,
J. Hi. Res. Chromatogr. Chromatogr. Comm., 1982, 5, 6, 325-328, https://doi.org/10.1002/jhrc.1240050610
. [all data]