Benzene, 1,2-bis(bromomethyl)-
- Formula: C8H8Br2
- Molecular weight: 263.957
- IUPAC Standard InChIKey: KGKAYWMGPDWLQZ-UHFFFAOYSA-N
- CAS Registry Number: 91-13-4
- Chemical structure:
View 3d structure (requires JavaScript / HTML 5) - Other names: o-Xylene, α,α'-dibromo-; α,α'-Dibromo-o-xylene; α,α'-Dibromo-o-xylol; o-Bis(bromomethyl)benzene; o-Xylylene dibromide; 1,2-Bis(bromomethyl)benzene; α,α '-Dibromo-ortho-xylene; 1,2-Di(bromomethyl)benzene; o-(Bromomethyl)benzyl bromide

Phase change data

Data compiled as indicated in comments:
BS - Robert L. Brown and Stephen E. Stein
TRC - Thermodynamics Research Center, NIST Boulder Laboratories, Chris Muzny director
AC - William E. Acree, Jr., James S. Chickos
Quantity | Value | Units | Method | Reference | Comment |
---|---|---|---|---|---|
Tfus | 368. | K | N/A | Buckingham and Donaghy, 1982 | BS |
Tfus | 370. | K | N/A | Colson, 1887 | Uncertainty assigned by TRC = 1. K; TRC |
Reduced pressure boiling point
Tboil (K) | Pressure (bar) | Reference | Comment |
---|---|---|---|
402.2 | 0.005 | Weast and Grasselli, 1989 | BS |
401. to 403. | 0.0060 | Buckingham and Donaghy, 1982 | BS |
Enthalpy of fusion
ΔfusH (kJ/mol) | Temperature (K) | Reference | Comment |
---|---|---|---|
26.78 | 368.2 | Acree, 1991 | AC |

References

Buckingham and Donaghy, 1982
Buckingham, J.; Donaghy, S.M.,
Dictionary of Organic Compounds: Fifth Edition, Chapman and Hall, New York, 1982, 1. [all data]
Colson, 1887
Colson, XX,
C. R. Hebd. Seances Acad. Sci., 1887, 104, 428. [all data]
Weast and Grasselli, 1989
CRC Handbook of Data on Organic Compounds, 2nd Editon, Weast,R.C and Grasselli, J.G., ed(s)., CRC Press, Inc., Boca Raton, FL, 1989, 1. [all data]
Acree, 1991
Acree, William E.,
Thermodynamic properties of organic compounds: enthalpy of fusion and melting point temperature compilation,
Thermochimica Acta, 1991, 189, 1, 37-56, https://doi.org/10.1016/0040-6031(91)87098-H
. [all data]