4,4'-Dichlorobenzophenone
- Formula: C13H8Cl2O
- Molecular weight: 251.108
- IUPAC Standard InChIKey: OKISUZLXOYGIFP-UHFFFAOYSA-N
- CAS Registry Number: 90-98-2
- Chemical structure:
View 3d structure (requires JavaScript / HTML 5) - Other names: Methanone, bis(4-chlorophenyl)-; Benzophenone, 4,4'-dichloro-; p,p'-Dichlorobenzophenone; Bis(4-chlorophenyl) ketone; DBP; DCBP; Di(p-Chlorophenyl)ketone; DCB; USAF DO-4; p-Dichlorobenzophenone; DBP (degradation product); NSC 8787; p,p-Dichlorobenzophenone; Dichloro-4,4'-dibenzophenone

Phase change data

Data compiled as indicated in comments:
BS - Robert L. Brown and Stephen E. Stein
TRC - Thermodynamics Research Center, NIST Boulder Laboratories, Chris Muzny director
AC - William E. Acree, Jr., James S. Chickos
DH - Eugene S. Domalski and Elizabeth D. Hearing
Quantity | Value | Units | Method | Reference | Comment |
---|---|---|---|---|---|
Tboil | 626.2 | K | N/A | Aldrich Chemical Company Inc., 1990 | BS |
Quantity | Value | Units | Method | Reference | Comment |
Tfus | 420.0 | K | N/A | Plato, 1972 | Uncertainty assigned by TRC = 0.2 K; TRC |
Quantity | Value | Units | Method | Reference | Comment |
ΔsubH° | 28.08 ± 0.07 | kcal/mol | ME | Ribeiro da Silva, Amaral, et al., 2007 | Based on data from 349. to 367. K.; AC |
Enthalpy of sublimation
ΔsubH (kcal/mol) | Temperature (K) | Method | Reference | Comment |
---|---|---|---|---|
27.37 ± 0.07 | 358. | ME | Ribeiro da Silva, Amaral, et al., 2007 | Based on data from 349. to 367. K.; AC |
Enthalpy of fusion
ΔfusH (kcal/mol) | Temperature (K) | Method | Reference | Comment |
---|---|---|---|---|
7.199 | 420. | DSC | Acree, 1991 | See also Plato, 1972, 2.; AC |
5.174 | 338.4 | DSC | Donnelly, Drewes, et al., 1990 | the entry for Ref. Donnelly, Drewes, et al., 1990 may likely be in error. The authors give the name of the compound as 4,4′-dichlorobenzophenone in the paper; however, they give the CAS Registry number of [85-29-0] which corresponds to 2,4′-dichlorobenzophenone. The observed melting point temperature of 338.4 K is more in line with the melting point temperature of 2,4′-dichlorobenzophenone; AC |
Enthalpy of phase transition
ΔHtrs (kcal/mol) | Temperature (K) | Initial Phase | Final Phase | Reference | Comment |
---|---|---|---|---|---|
0.0349 | 186.1 | crystaline, III | crystaline, II | Ecolivet, Bertault, et al., 1987 | DH |
0.0600 | 189.5 | crystaline, II | crystaline, I | Ecolivet, Bertault, et al., 1987 | DH |

Kovats' RI, non-polar column, isothermal

Column type | Active phase | Temperature (C) | I | Reference | Comment |
---|---|---|---|---|---|
Capillary | OV-1 | 190. | 1947. | Erdmann, Rochholz, et al., 1992 | |
Capillary | OV-1 | 220. | 1979. | Erdmann, Rochholz, et al., 1992 |

Normal alkane RI, non-polar column, custom temperature program

Column type | Active phase | I | Reference | Comment |
---|---|---|---|---|
Capillary | 5 % Phenyl methyl siloxane | 2014. | Department of Food Safety and Welfare, 2006 | 30. m/0.25 mm/0.25 μm, Helium; Program: 50 0C(1 min) 25 0C/min -> 125 0C 10 0C/min -> 300 0C (10 min) |
Capillary | 5 % Phenyl methyl siloxane | 2018. | Department of Food Safety and Welfare, 2006 | 30. m/0.25 mm/0.25 μm, Helium; Program: 50 0C(1 min) 25 0C/min -> 125 0C 10 0C/min -> 300 0C (10 min) |

References

Aldrich Chemical Company Inc., 1990
Aldrich Chemical Company Inc.,
Catalog Handbook of Fine Chemicals, Aldrich Chemical Company, Inc., Milwaukee WI, 1990, 1. [all data]
Plato, 1972
Plato, C.,
DSC as a general method for determining purity and heat of fusion of high-purity organic chemicals,
Anal. Chem., 1972, 44, 1531. [all data]
Ribeiro da Silva, Amaral, et al., 2007
Ribeiro da Silva, Manuel A.V.; Amaral, Luísa M.P.F.; Gomes, José R.B.,
Experimental and Computational Studies on the Molecular Energetics of Chlorobenzophenones,
J. Phys. Chem. B, 2007, 111, 45, 13033-13040, https://doi.org/10.1021/jp076522j
. [all data]
Acree, 1991
Acree, William E.,
Thermodynamic properties of organic compounds: enthalpy of fusion and melting point temperature compilation,
Thermochimica Acta, 1991, 189, 1, 37-56, https://doi.org/10.1016/0040-6031(91)87098-H
. [all data]
Plato, 1972, 2
Plato, Candace.,
Differential scanning calorimetry as a general method for determining purity and heat of fusion of high-purity organic chemicals. Application to 64 compounds,
Anal. Chem., 1972, 44, 8, 1531-1534, https://doi.org/10.1021/ac60316a049
. [all data]
Donnelly, Drewes, et al., 1990
Donnelly, J.R.; Drewes, L.A.; Johnson, R.L.; Munslow, W.D.; Knapp, K.K.; Sovocool, G.W.,
Purity and heat of fusion data for environmental standards as determined by differential scanning calorimetry,
Thermochimica Acta, 1990, 167, 2, 155-187, https://doi.org/10.1016/0040-6031(90)80476-F
. [all data]
Ecolivet, Bertault, et al., 1987
Ecolivet, C.; Bertault, M.; Mierzejewski, A.; Collet, A.,
Brillouin scattering and calorimetric studies of structural phase transitions in anthracene-TCNB and p-dichlorobenzophenone,
Stud. Phys. Theor. Chem., 1987, 46, 187-192. [all data]
Erdmann, Rochholz, et al., 1992
Erdmann, F.; Rochholz, G.; Schütz, H.,
Retention-indices on OV-1 of approximately 170 commonly used pesticides,
Mikrochim. Acta, 1992, 106, 3-6, 219-226, https://doi.org/10.1007/BF01242093
. [all data]
Department of Food Safety and Welfare, 2006
Department of Food Safety, Ministry of Health; Welfare,
Analytical methods for residual compositional substances of agricultural chemicals, feed aadditives, and veterinary drugs in foods, 2006, retrieved from http://www.mhlw.go.jp/english/topics/foodsafety/positivelist060228/de/060526-1a.pdf. [all data]