Methanone, (4-bromophenyl)phenyl-
- Formula: C13H9BrO
- Molecular weight: 261.114
- IUPAC Standard InChIKey: KEOLYBMGRQYQTN-UHFFFAOYSA-N
- CAS Registry Number: 90-90-4
- Chemical structure:
View 3d structure (requires JavaScript / HTML 5) - Other names: Benzophenone, 4-bromo-; p-Bromobenzophenone; 4-Bromobenzophenone; USAF do-3

Phase change data

Data compiled by: Robert L. Brown and Stephen E. Stein
Quantity | Value | Units | Method | Reference | Comment |
---|---|---|---|---|---|
Tboil | 623.2 | K | N/A | Aldrich Chemical Company Inc., 1990 | |
Tboil | 623. | K | N/A | Buckingham and Donaghy, 1982 | |
Quantity | Value | Units | Method | Reference | Comment |
Tfus | 355.6 | K | N/A | Buckingham and Donaghy, 1982 |

Normal alkane RI, non-polar column, temperature ramp

Column type | Active phase | I | Reference | Comment |
---|---|---|---|---|
Capillary | Ultra-1 | 1841. | Okumura, 1991 | 25. m/0.32 mm/0.25 μm, He, 3. K/min; Tstart: 80. C; Tend: 260. C |

References

Aldrich Chemical Company Inc., 1990
Aldrich Chemical Company Inc.,
Catalog Handbook of Fine Chemicals, Aldrich Chemical Company, Inc., Milwaukee WI, 1990, 1. [all data]
Buckingham and Donaghy, 1982
Buckingham, J.; Donaghy, S.M.,
Dictionary of Organic Compounds: Fifth Edition, Chapman and Hall, New York, 1982, 1. [all data]