1-Piperazinecarboxamide, N,N-diethyl-4-methyl-
- Formula: C10H21N3O
- Molecular weight: 199.2932
- IUPAC Standard InChIKey: RCKMWOKWVGPNJF-UHFFFAOYSA-N
- CAS Registry Number: 90-89-1
- Chemical structure:
View 3d structure (requires JavaScript / HTML 5) - Other names: Diethylcarbamazine; Bitirazine; Caracide; Carbamazine; Carbilazine; Caricide; Cypip; Ditrazine base; Ethodryl; Notezine; R.P. 3799; RP 3799; Spatonin; 1-Diethylcarbamoyl-4-methylpiperazine; 1-Diethylcarbamoyl-4-methylpiperzine; 1-Methyl-4-diethylcarbamoylpiperazine; 84L; 1-(N,N-Diethylcarbamoyl)-4-methylpiperazine; N,N-Diethyl-4-methyl-1-piperazinecarboxamide

Phase change data

Data compiled as indicated in comments:
BS - Robert L. Brown and Stephen E. Stein
TRC - Thermodynamics Research Center, NIST Boulder Laboratories, Chris Muzny director
Quantity | Value | Units | Method | Reference | Comment |
---|---|---|---|---|---|
Tfus | 322.37 | K | N/A | Witschonke, 1954 | Uncertainty assigned by TRC = 0.4 K; TRC |
Tfus | 322.75 | K | N/A | Witschonke, 1954 | Uncertainty assigned by TRC = 0.2 K; TRC |
Reduced pressure boiling point
Tboil (K) | Pressure (bar) | Reference | Comment |
---|---|---|---|
383.2 | 0.004 | Weast and Grasselli, 1989 | BS |
412. to 414. | 0.019 | Frinton Laboratories Inc., 1986 | BS |

References

Witschonke, 1954
Witschonke, C.R.,
Freezing point and purity data for some organic compounds,
Anal. Chem., 1954, 26, 562-4. [all data]
Weast and Grasselli, 1989
CRC Handbook of Data on Organic Compounds, 2nd Editon, Weast,R.C and Grasselli, J.G., ed(s)., CRC Press, Inc., Boca Raton, FL, 1989, 1. [all data]
Frinton Laboratories Inc., 1986
Frinton Laboratories Inc.,
Catalog Number 11, Frinton Laboratories Inc., Vineland, NJ, 1986, 99. [all data]