Cyclopentene, 1-methyl-4-(1-methylethyl)
- Formula: C9H16
- Molecular weight: 124.2233
- IUPAC Standard InChIKey: KBKZDZOQXUMEJU-UHFFFAOYSA-N
- CAS Registry Number: 90769-70-3
- Chemical structure:
View 3d structure (requires JavaScript / HTML 5) - Stereoisomers:

Normal alkane RI, non-polar column, custom temperature program

Column type | Active phase | I | Reference | Comment |
---|---|---|---|---|
Capillary | Methyl Silicone | 872. | Zenkevich, 1995 | Program: not specified |

References

Zenkevich, 1995
Zenkevich, I.G.,
Calculation of Gas-Chromatographic Retention Indices from Physico-Chemical Constants of Organic Compounds,
Z. Anal. Chem., 1995, 50, 10, 1048-1056. [all data]