Mandelic acid

Phase change data

Data compiled by: Thermodynamics Research Center, NIST Boulder Laboratories, Chris Muzny director

Quantity Value Units Method Reference Comment
Tfus392.0KN/ADishart and Levine, 1956Uncertainty assigned by TRC = 1.5 K

In addition to the Thermodynamics Research Center (TRC) data available from this site, much more physical and chemical property data is available from the following TRC products:

Condensed phase thermochemistry data

Data compiled by: Eugene S. Domalski and Elizabeth D. Hearing

Constant pressure heat capacity of solid

Cp,solid (J/mol*K) Temperature (K) Reference Comment
199.2323.Satoh and Sogabe, 1941T = 0 to 100 C. Mean value.

Normal alkane RI, non-polar column, custom temperature program

View large format table.

Column type Active phase I Reference Comment
OtherMethyl Silicone1487.Ardrey and Moffat, 1981Program: not specified

References

Dishart and Levine, 1956
Dishart, K.T.; Levine, R., A New Synthesis of Ketones Containing One Perfluoroalkyl Group, J. Am. Chem. Soc., 1956, 78, 2268. [all data]