9-Acridinamine
- Formula: C13H10N2
- Molecular weight: 194.2319
- IUPAC Standard InChIKey: XJGFWWJLMVZSIG-UHFFFAOYSA-N
- CAS Registry Number: 90-45-9
- Chemical structure:

Condensed phase thermochemistry data

Data compiled by: Hussein Y. Afeefy, Joel F. Liebman, and Stephen E. Stein
Quantity | Value | Units | Method | Reference | Comment |
---|---|---|---|---|---|
ΔcH°solid | -6704.0 ± 7.1 | kJ/mol | Ccb | Willis, 1947 | Reanalyzed by Cox and Pilcher, 1970, Original value = -6702.3 ± 7.1 kJ/mol |

References

Willis, 1947
Willis, J.B.,
The heats of combustion of some organic bases and their salts. The resonance energies of acridine and phenazine,
Trans. Faraday Soc., 1947, 43, 97-102. [all data]
Cox and Pilcher, 1970
Cox, J.D.; Pilcher, G.,
Thermochemistry of Organic and Organometallic Compounds, Academic Press, New York, 1970, 1-636. [all data]