Benzeneacetic acid, α-ethyl-
- Formula: C10H12O2
- Molecular weight: 164.2011
- IUPAC Standard InChIKey: OFJWFSNDPCAWDK-UHFFFAOYSA-N
- CAS Registry Number: 90-27-7
- Chemical structure:
View 3d structure (requires JavaScript / HTML 5) - Other names: Butyric acid, 2-phenyl-; α-Phenylbutyric acid; α-Toluic acid, α-ethyl-; 2-Phenylbutyric acid; α-Phenyl-n-butyric acid; (.+/-.)-2-Phenylbutanoic acid; 2-Phenylbutanoic acid; (.+/-.)-2-Phenylbutyric acid; NSC 1860; α-Ethylphenylacetic acid; αEthylbenzeneacetic acid

Phase change data

Data compiled by: Robert L. Brown and Stephen E. Stein
Quantity | Value | Units | Method | Reference | Comment |
---|---|---|---|---|---|
Tboil | 544.2 | K | N/A | Weast and Grasselli, 1989 |

Van Den Dool and Kratz RI, non-polar column, custom temperature program

Column type | Active phase | I | Reference | Comment |
---|---|---|---|---|
Capillary | VF-5MS | 1414.9 | Tret'yakov, 2007 | 30. m/0.25 mm/0.25 μm, He; Program: Multi-step temperature program; T(initial)=60C; T(final)=270C |

Lee's RI, non-polar column, custom temperature program

Column type | Active phase | I | Reference | Comment |
---|---|---|---|---|
Capillary | Methyl Silicone | 236.36 | Eckel, Ross, et al., 1993 | Program: not specified |

References

Weast and Grasselli, 1989
CRC Handbook of Data on Organic Compounds, 2nd Editon, Weast,R.C and Grasselli, J.G., ed(s)., CRC Press, Inc., Boca Raton, FL, 1989, 1. [all data]
Tret'yakov, 2007
Tret'yakov, K.V.,
Retention Data. NIST Mass Spectrometry Data Center., NIST Mass Spectrometry Data Center, 2007. [all data]
Eckel, Ross, et al., 1993
Eckel, W.P.; Ross, B.; Isensee, R.K.,
Pentobarbital found in ground water,
Ground Water, 1993, 31, 5, 801-804, https://doi.org/10.1111/j.1745-6584.1993.tb00853.x
. [all data]