Benzenemethanol, α-(trichloromethyl)-, acetate
- Formula: C10H9Cl3O2
- Molecular weight: 267.536
- IUPAC Standard InChIKey: JKRWZLOCPLZZEI-UHFFFAOYSA-N
- CAS Registry Number: 90-17-5
- Chemical structure:
View 3d structure (requires JavaScript / HTML 5) - Other names: Rosacetol; α-(Trichloromethyl)benzyl acetate; Acetic acid, α-(trichloromethyl)benzyl ester; Benzyl alcohol, α-(trichloromethyl)-, acetate; Rose crystals; Trichlor phenyl methyl carbinyl acetate; Trichloromethylphenylcarbinyl acetate; Rose ester; Rosephenone; 2,2,2-Trichloro-1-phenylethyl acetate; Benzenemethanol, α-(trichloromethyl)-, 1-acetate; 2-Acetoxy-1,1,1-trichloro-2-phenylethane; Crystal rose; Rosetone; Rosone; NSC 165582; Rose acetate

Kovats' RI, non-polar column, isothermal

Column type | Active phase | Temperature (C) | I | Reference | Comment |
---|---|---|---|---|---|
Capillary | SE-30 | 100. | 1541.3 | Tudor, 1997 | 40. m/0.35 mm/0.35 μm |

Normal alkane RI, non-polar column, temperature ramp

Column type | Active phase | I | Reference | Comment |
---|---|---|---|---|
Capillary | DB-1 MS | 1522. | Seo, Kim, et al., 2009 | 30. m/0.25 mm/0.25 μm, Helium, 40. C @ 1. min, 6. K/min, 250. C @ 4. min |

Normal alkane RI, non-polar column, custom temperature program

Column type | Active phase | I | Reference | Comment |
---|---|---|---|---|
Capillary | SE-30 | 1538. | Vinogradov, 2004 | Program: not specified |

Normal alkane RI, polar column, temperature ramp

Column type | Active phase | I | Reference | Comment |
---|---|---|---|---|
Capillary | Innowax | 2222. | Seo, Kim, et al., 2009 | 30. m/0.25 mm/0.25 μm, Helium, 40. C @ 1. min, 6. K/min, 250. C @ 4. min |

Normal alkane RI, polar column, custom temperature program

Column type | Active phase | I | Reference | Comment |
---|---|---|---|---|
Capillary | Carbowax 20M | 2172. | Vinogradov, 2004 | Program: not specified |

References

Tudor, 1997
Tudor, E.,
Temperature dependence of the retention index for perfumery compounds on a SE-30 glass capillary column. I. Linear equations,
J. Chromatogr. A, 1997, 779, 1-2, 287-297, https://doi.org/10.1016/S0021-9673(97)00453-6
. [all data]
Seo, Kim, et al., 2009
Seo, S.-M.; Kim, J.; Lee, S.-G.; Shin, C.-H.; Shin, S.-C.; Park, I.-K.,
Fumigant antitermitic activity of plant essential oils and components from Aiowan (Trachyspermum ammi), Allspice (Pimenta dioica), Caraway (Carum carvi), Dill (Anethum graveolens), Geranium (Pelargonium graveolens), and Litsea (Litsea cubeba( oils against Japanese termite (Reticulitermes speratus Kolbe),
J. Agric. Food Chem., 2009, 57, 15, 6596-6602. [all data]
Vinogradov, 2004
Vinogradov, B.A.,
Production, composition, properties and application of essential oils, 2004, retrieved from http://viness.narod.ru. [all data]