Phenol, 2-methoxy-
- Formula: C7H8O2
- Molecular weight: 124.1372
- IUPAC Standard InChIKey: LHGVFZTZFXWLCP-UHFFFAOYSA-N
- CAS Registry Number: 90-05-1
- Chemical structure:
View 3d structure (requires JavaScript / HTML 5) - Other names: Phenol, o-methoxy-; o-Guaiacol; o-Hydroxyanisole; o-Methoxyphenol; Anastil; Guaiacol; Guaiastil; Guaicolina; Guajol; Guasol; O-Methyl catechol; Pyrocatechol monomethyl ether; Pyroguaiac acid; 1-Hydroxy-2-methoxybenzene; 2-Hydroxyanisole; 2-Methoxyphenol; Guaicol; Guajakol; Methylcatechol; Methylcatachol; Catechol monomethyl ether; o-Guiacol; ortho-Guaiacol; NSC 3815; 2-methoxyphenol (guaiacol); 2-Methoxy phenol (guiacol); guiacol; guaiacol (2-methoxyphenol)

Phase change data

Data compiled as indicated in comments:
BS - Robert L. Brown and Stephen E. Stein
TRC - Thermodynamics Research Center, NIST Boulder Laboratories, Chris Muzny director
AC - William E. Acree, Jr., James S. Chickos
Quantity | Value | Units | Method | Reference | Comment |
---|---|---|---|---|---|
Tboil | 478.2 | K | N/A | Weast and Grasselli, 1989 | BS |
Tboil | 478.20 | K | N/A | Lecat, 1947 | Uncertainty assigned by TRC = 0.6 K; TRC |
Tboil | 478.20 | K | N/A | Lecat, 1927 | Uncertainty assigned by TRC = 0.5 K; TRC |
Tboil | 478.3 | K | N/A | Lecat, 1926 | Uncertainty assigned by TRC = 0.5 K; TRC |
Tboil | 478.15 | K | N/A | Clever and Muthmann, 1896 | Uncertainty assigned by TRC = 1. K; TRC |
Quantity | Value | Units | Method | Reference | Comment |
Tfus | 301.15 | K | N/A | Lindberg and Stenholm, 1966 | Uncertainty assigned by TRC = 0.4 K; TRC |
Tfus | 301.25 | K | N/A | Philip and Smith, 1905 | Uncertainty assigned by TRC = 0.4 K; TRC |
Tfus | 301.45 | K | N/A | Clever and Muthmann, 1896 | Uncertainty assigned by TRC = 0.6 K; TRC |
Quantity | Value | Units | Method | Reference | Comment |
ΔvapH° | 62.6 ± 0.5 | kJ/mol | C | Matos, Miranda, et al., 2003 | AC |
Enthalpy of vaporization
ΔvapH (kJ/mol) | Temperature (K) | Method | Reference | Comment |
---|---|---|---|---|
52.7 | 393. | A | Stephenson and Malanowski, 1987 | Based on data from 378. to 479. K. See also Kkykj and Repas, 1973.; AC |
52.7 | 370. | N/A | von Terres, Gebert, et al., 1955 | Based on data from 355. to 478. K.; AC |
Antoine Equation Parameters
log10(P) = A − (B / (T + C))
P = vapor pressure (bar)
T = temperature (K)
View plot Requires a JavaScript / HTML 5 canvas capable browser.
Temperature (K) | A | B | C | Reference | Comment |
---|---|---|---|---|---|
355. to 478. | 4.36309 | 1753.447 | -74.81 | von Terres, Gebert, et al., 1955, 2 | Coefficents calculated by NIST from author's data. |
325.6 to 478. | 5.5607 | 2484.596 | -31.035 | Stull, 1947 | Coefficents calculated by NIST from author's data. |

Henry's Law data

Data compiled by: Rolf Sander
Henry's Law constant (water solution)
kH(T) = k°H exp(d(ln(kH))/d(1/T) ((1/T) - 1/(298.15 K)))
k°H = Henry's law constant for solubility in water at 298.15 K (mol/(kg*bar))
d(ln(kH))/d(1/T) = Temperature dependence constant (K)
k°H (mol/(kg*bar)) | d(ln(kH))/d(1/T) (K) | Method | Reference |
---|---|---|---|
900. | 7500. | X | N/A |

Gas phase ion energetics data

Data compiled by: John E. Bartmess
De-protonation reactions
C7H7O2- + =
By formula: C7H7O2- + H+ = C7H8O2
Quantity | Value | Units | Method | Reference | Comment |
---|---|---|---|---|---|
ΔrG° | 1433. ± 8.4 | kJ/mol | IMRE | Kebarle and McMahon, 1977 | gas phase |

Reaction thermochemistry data

Data compiled by: John E. Bartmess
Individual Reactions
C7H7O2- + =
By formula: C7H7O2- + H+ = C7H8O2
Quantity | Value | Units | Method | Reference | Comment |
---|---|---|---|---|---|
ΔrG° | 342.5 ± 2.0 | kcal/mol | IMRE | Kebarle and McMahon, 1977 | gas phase |

Kovats' RI, non-polar column, isothermal

Column type | Active phase | Temperature (C) | I | Reference | Comment |
---|---|---|---|---|---|
Capillary | SE-30 | 100. | 1066.8 | Tudor, 1997 | 40. m/0.35 mm/0.35 μm |
Packed | OV-1 | 180. | 1047. | Radecki and Grzybowski, 1978 | Chromosorb W HMDS (100-120 mesh); Column length: 2.1 m |
Packed | SE-30 | 180. | 1075. | Viani, Müggler-Chavan, et al., 1965 | He, Chromosorb P; Column length: 6. m |

Kovats' RI, non-polar column, temperature ramp

Column type | Active phase | I | Reference | Comment |
---|---|---|---|---|
Capillary | HP-5MS | 1090. | Asuming, Beauchamp, et al., 2005 | 30. m/0.25 mm/0.25 μm, He, 50. C @ 10. min, 3. K/min, 250. C @ 5. min |
Capillary | DB-1 | 1059. | Takeoka, Perrino, et al., 1996 | 60. m/0.25 mm/0.25 μm, 30. C @ 4. min, 2. K/min; Tend: 220. C |
Capillary | DB-1 | 1059. | Takeoka, Perrino, et al., 1996 | 60. m/0.25 mm/0.25 μm, 30. C @ 4. min, 2. K/min; Tend: 220. C |
Capillary | OV-101 | 1072. | Shibamoto, Kamiya, et al., 1981 | N2, 1. K/min; Column length: 80. m; Column diameter: 0.28 mm; Tstart: 80. C; Tend: 200. C |
Capillary | OV-101 | 1077. | Shibamoto, Kamiya, et al., 1981 | N2, 1. K/min; Column length: 80. m; Column diameter: 0.28 mm; Tstart: 80. C; Tend: 200. C |
Capillary | OV-101 | 1070. | Yamaguchi and Shibamoto, 1979 | N2, 2. K/min; Column length: 70. m; Column diameter: 0.28 mm; Tstart: 80. C; Tend: 200. C |
Capillary | OV-101 | 1071. | Yamaguchi and Shibamoto, 1979 | N2, 2. K/min; Column length: 70. m; Column diameter: 0.28 mm; Tstart: 80. C; Tend: 200. C |

Kovats' RI, non-polar column, custom temperature program

Column type | Active phase | I | Reference | Comment |
---|---|---|---|---|
Packed | SE-30 | 1095. | Grzybowski, Lamparczyk, et al., 1980 | Chromosorb W HMDS (80-100 mesh); Column length: 2.9 m; Program: not specified |

Kovats' RI, polar column, isothermal

Column type | Active phase | Temperature (C) | I | Reference | Comment |
---|---|---|---|---|---|
Capillary | Carbowax 20M | 150. | 1880. | Tudor, Moldovan, et al., 1999 | Phase thickness: 0.45 μm |

Van Den Dool and Kratz RI, non-polar column, temperature ramp

Column type | Active phase | I | Reference | Comment |
---|---|---|---|---|
Capillary | DB-5 | 1089. | Baccouri, Ben Temime, et al., 2007 | 30. m/0.25 mm/0.25 μm, He, 3. K/min; Tstart: 60. C; Tend: 240. C |
Capillary | HP-5MS | 1096. | Jarunrattanasri, Theerakulkait, et al., 2007 | 30. m/0.25 mm/0.5 μm, He, 35. C @ 5. min, 4. K/min, 225. C @ 30. min |
Capillary | HP-5MS | 1092. | Jarunrattanasri, Theerakulkait, et al., 2007 | 30. m/0.25 mm/0.5 μm, He, 35. C @ 5. min, 4. K/min, 225. C @ 30. min |
Capillary | DB-5MS | 1096. | Lozano P.R., Drake M., et al., 2007 | 30. m/0.25 mm/0.25 μm, He, 35. C @ 5. min, 10. K/min, 225. C @ 25. min |
Capillary | DB-5MS | 1097. | Lozano P.R., Drake M., et al., 2007 | 30. m/0.25 mm/0.25 μm, He, 35. C @ 5. min, 10. K/min, 225. C @ 25. min |
Capillary | DB-5 | 1106. | Ruiz Perez-Cacho, Mahattanatawee, et al., 2007 | 30. m/0.32 mm/0.5 μm, 7. K/min, 265. C @ 5. min; Tstart: 40. C |
Capillary | DB-5 | 1090. | Steinhaus and Schieberle, 2007 | 30. m/0.32 mm/0.25 μm, 40. C @ 2. min, 6. K/min, 240. C @ 10. min |
Capillary | BP-1 | 1059. | Duquesnoy, Dinh, et al., 2006 | 50. m/0.22 mm/0.25 μm, He, 2. K/min, 220. C @ 20. min; Tstart: 60. C |
Capillary | CP Sil 8 CB | 1084. | Mahadevan and Farmer, 2006 | 60. C @ 5. min, 4. K/min, 220. C @ 30. min; Column length: 50. m; Column diameter: 0.32 mm |
Capillary | DB-5 | 1084. | Alves, Pinto, et al., 2005 | 30. m/0.25 mm/0.25 μm, H2, 5. K/min, 270. C @ 20. min; Tstart: 35. C |
Capillary | DB-5MS | 1095. | Carunchia Whetstine, Croissant, et al., 2005 | 30. m/0.25 mm/0.25 μm, 40. C @ 3. min, 10. K/min, 200. C @ 20. min |
Capillary | DB-5 | 1090. | Gocmen, Elston, et al., 2005 | 60. m/0.25 mm/0.25 μm, 7. K/min; Tstart: 40. C; Tend: 275. C |
Capillary | DB-5 | 1095. | Gocmen, Elston, et al., 2005 | 60. m/0.25 mm/0.25 μm, 7. K/min; Tstart: 40. C; Tend: 275. C |
Capillary | HP-5 | 1089. | Mahattanatawee, Goodner, et al., 2005 | 30. m/0.25 mm/0.25 μm, He, 50. C @ 5. min, 4. K/min, 250. C @ 15. min |
Capillary | HP-5 | 1090. | Mahattanatawee, Goodner, et al., 2005 | 30. m/0.25 mm/0.25 μm, He, 50. C @ 5. min, 4. K/min, 250. C @ 15. min |
Capillary | DB-5MS | 1092. | Whetstine, Cadwallader, et al., 2005 | 30. m/0.25 mm/0.25 μm, 40. C @ 3. min, 10. K/min, 200. C @ 20. min |
Capillary | DB-5 | 1087. | Adams, Habte, et al., 2004 | 30. m/0.26 mm/0.25 μm, He, 3. K/min; Tstart: 60. C; Tend: 246. C |
Capillary | CP-Sil 8CB-MS | 1091. | Hierro, de la Hoz, et al., 2004 | 60. m/0.25 mm/0.25 μm, 40. C @ 2. min, 4. K/min, 280. C @ 5. min |
Capillary | SPB-5 | 1087. | Pino, Marbot, et al., 2004 | 30. m/0.25 mm/0.25 μm, He, 60. C @ 2. min, 4. K/min, 250. C @ 20. min |
Capillary | HP-1 | 1057. | Cavalli, Fernandez, et al., 2003 | 50. m/0.2 mm/0.33 μm, He, 60. C @ 5. min, 2. K/min, 250. C @ 20. min |
Capillary | HP-1 | 1052. | Cavalli, Fernandez, et al., 2003 | 50. m/0.2 mm/0.33 μm, He, 60. C @ 5. min, 2. K/min, 250. C @ 20. min |
Capillary | DB-5 | 1091. | Högnadóttir and Rouseff, 2003 | 30. m/0.32 mm/0.5 μm, 7. K/min, 265. C @ 5. min; Tstart: 40. C |
Capillary | DB-5MS | 1086. | Karagül-Yüceer, Vlahovich, et al., 2003 | 30. m/0.25 mm/0.25 μm, He, 35. C @ 5. min, 10. K/min, 200. C @ 30. min |
Capillary | HP-5MS | 1086. | Demetzos, Angelopoulou, et al., 2002 | 30. m/0.25 mm/0.25 μm, 50. C @ 5. min, 3. K/min; Tend: 280. C |
Capillary | DB-5 | 1102. | Wu and Cadwallader, 2002 | 30. m/0.32 mm/0.25 μm, He, 40. C @ 5. min, 10. K/min, 220. C @ 30. min |
Capillary | DB-1 | 1062. | Kim, 2001 | 60. m/0.32 mm/1. μm, He, 40. C @ 5. min, 2. K/min; Tend: 220. C |
Capillary | BPX-5 | 1101. | Oruna-Concha, Duckham, et al., 2001 | 50. m/0.32 mm/0.25 μm, He, 35. C @ 3. min, 4. K/min, 250. C @ 10. min |
Capillary | SE-54 | 1089.05 | Yin, Xiu, et al., 2001 | 35. C @ 3. min, 4. K/min, 230. C @ 10. min; Column length: 25. m; Column diameter: 0.31 mm |
Capillary | CP Sil 8 CB | 1087. | Chevance and Farmer, 1999 | 60. C @ 5. min, 4. K/min, 220. C @ 30. min; Column length: 50. m; Column diameter: 0.32 mm |
Capillary | CP Sil 8 CB | 1086. | Chevance and Farmer, 1999 | 60. C @ 5. min, 4. K/min, 220. C @ 30. min; Column length: 50. m; Column diameter: 0.32 mm |
Capillary | DB-5 | 1074. | da Silva, Borba, et al., 1999 | 30. m/0.25 mm/0.25 μm, H2, 4. K/min; Tstart: 50. C; Tend: 290. C |
Capillary | BPX-5 | 1114. | Aaslyng, Elmore, et al., 1998 | 50. m/0.32 mm/0.50 μm, He, 4. K/min; Tstart: 40. C; Tend: 280. C |
Capillary | SE-54 | 1096. | Li, Wang, et al., 1998 | H2, 35. C @ 3. min, 4. K/min; Column length: 25. m; Column diameter: 0.31 mm; Tend: 250. C |
Capillary | DB-1 | 1080. | Bartelt, 1997 | 30. m/0.32 mm/5. μm, He, 35. C @ 1. min, 10. K/min; Tend: 270. C |
Capillary | OV-1 | 1060.1 | Gautzsch and Zinn, 1996 | 8. K/min; Tstart: 35. C; Tend: 300. C |
Capillary | DB-1 | 1068. | Stashenko, Prada, et al., 1996 | 60. m/0.25 mm/0.25 μm, He, 50. C @ 5. min, 3.5 K/min; Tend: 250. C |
Packed | SE-30 | 1080. | Peng, Ding, et al., 1988 | He, Supelcoport and Chromosorb, 40. C @ 4. min, 10. K/min, 250. C @ 60. min; Column length: 3.05 m |

Van Den Dool and Kratz RI, non-polar column, custom temperature program

Column type | Active phase | I | Reference | Comment |
---|---|---|---|---|
Capillary | DB-5 | 1089. | Escudero, Campo, et al., 2007 | Program: not specified |
Capillary | VF-5MS | 1102.4 | Tret'yakov, 2007 | 30. m/0.25 mm/0.25 μm, He; Program: Multi-step temperature program; T(initial)=60C; T(final)=270C |
Capillary | DB-5MS | 1110. | Varlet, Serot, et al., 2007 | 30. m/0.32 mm/0.5 μm, He; Program: 70C => 5C/min => 85C(1min) => 3C/min => 165C => 10C/min => 280C(3min) |
Capillary | SE-54 | 1087. | Frauendorfer and Schieberle, 2006 | 25. m/0.32 mm/0.25 μm, He; Program: 40C(1min) => 40C/min => 60C(1min) => 4C/min => 140C => 20C/min => 240C(5min) |
Capillary | HP-5 | 1097. | Künzel, Breuer, et al., 2006 | Program: not specified |
Capillary | SE-54 | 1089. | Schuh and Schieberle, 2006 | 30. m/0.32 mm/0.25 μm; Program: 40C(2min) => 6C/min => 150C => 20C/min => 230C |
Capillary | DB-5MS | 1110. | Varlet V., Knockaert C., et al., 2006 | 30. m/0.32 mm/0.5 μm, He; Program: 70C(1min) => 3C/min => 80C(1min) => 5C/min => 150C => 10C/min => 280C (4min) |
Capillary | DB-5 | 1088. | Jezussek, Juliano, et al., 2002 | 30. m/0.32 mm/0.25 μm, He; Program: 40C(1min) => 40C/min => 50C(2min) => 6C/min => 240C |
Capillary | LM-5 | 1092.4 | Ré-Poppi and Santiago-Silva, 2002 | 30. m/0.25 mm/0.25 μm, He; Program: 60C(2min) => 15C/min => 180C => 5C/min => 280C(5min) |
Capillary | DB-5MS | 1071. | Boulanger and Crouzet, 2001 | 30. m/0.25 mm/0.25 μm, H2; Program: 40C (5min) => 2C/min => 200C => 5C/min => 250C (15min) |
Capillary | DB-5 | 1091. | Munk, Munch, et al., 2000 | 30. m/0.32 mm/0.25 μm; Program: 40C(2min) => 40C/min => 50C (1min) => 6C/min => 180C => 10C/min => 240C (5min) |
Capillary | DB-5 | 1090. | Munk, Munch, et al., 2000 | 30. m/0.32 mm/0.25 μm; Program: 40C(2min) => 40C/min => 50C (1min) => 6C/min => 180C => 10C/min => 240C (5min) |
Capillary | SE-54 | 1087. | Derail, Hofmann, et al., 1999 | 30. m/0.32 mm/0.25 μm, He; Program: 35C (2min) => 40C/min => 50C => 4C/min => 230C (10min) |
Capillary | SE-54 | 1087. | Fickert and Schieberle, 1998 | 25. m/0.32 mm/0.5 μm, He; Program: 35C (2min) => 4C/min => 150C => 10C/min => 240C |
Capillary | SE-54 | 1094. | Li, Wang, et al., 1998 | H2; Column length: 25. m; Column diameter: 0.31 mm; Program: not specified |
Capillary | SE-54 | 1090. | Münch, Hofmann, et al., 1997 | 30. m/0.32 mm/0.25 μm, He; Program: 40C (2min) => 40C/min => 50C (2min) => 240C (10min) |
Capillary | BPX-5 | 1104. | Owens J.D., Allagheny N., et al., 1997 | 50. m/0.32 mm/0.5 μm, He; Program: OC => 60C/min => 60C(5min) => 4C/min => 250C(20min) |
Capillary | HP-1 | 1071. | Sing, Smadja, et al., 1992 | 50. m/0.32 mm/1.05 μm, He; Program: 20C(0.5min) => 60C => 4C/min => 250C |

Van Den Dool and Kratz RI, polar column, temperature ramp

Column type | Active phase | I | Reference | Comment |
---|---|---|---|---|
Capillary | DB-Wax | 1862. | Botelho, Caldeira, et al., 2007 | 30. m/0.25 mm/0.25 μm, He, 50. C @ 2. min, 3.5 K/min, 180. C @ 25. min |
Capillary | Innowax | 1875. | Botelho, Caldeira, et al., 2007 | 30. m/0.25 mm/0.25 μm, H2, 45. C @ 5. min, 3.5 K/min, 210. C @ 20. min |
Capillary | DB-FFAP | 1867. | Jarunrattanasri, Theerakulkait, et al., 2007 | 30. m/0.25 mm/0.5 μm, He, 35. C @ 5. min, 4. K/min, 225. C @ 30. min |
Capillary | DB-FFAP | 1871. | Jarunrattanasri, Theerakulkait, et al., 2007 | 30. m/0.25 mm/0.5 μm, He, 35. C @ 5. min, 4. K/min, 225. C @ 30. min |
Capillary | FFAP | 1862. | Lozano P.R., Drake M., et al., 2007 | 30. m/0.25 mm/0.25 μm, He, 35. C @ 5. min, 10. K/min, 225. C @ 25. min |
Capillary | FFAP | 1841. | Lozano P.R., Drake M., et al., 2007 | 30. m/0.25 mm/0.25 μm, He, 35. C @ 5. min, 10. K/min, 225. C @ 25. min |
Capillary | DB-Wax | 1860. | Pozo-Bayon M.A., Ruiz-Rodriguez A., et al., 2007 | 30. m/0.25 mm/0.5 μm, He, 40. C @ 5. min, 4. K/min, 250. C @ 15. min |
Capillary | DB-Wax | 1871. | Ruiz Perez-Cacho, Mahattanatawee, et al., 2007 | 30. m/0.32 mm/0.5 μm, He, 7. K/min, 240. C @ 5. min; Tstart: 40. C |
Capillary | FFAP | 1846. | Steinhaus and Schieberle, 2007 | 30. m/0.32 mm/0.25 μm, 40. C @ 2. min, 6. K/min, 240. C @ 10. min |
Capillary | BP-20 | 1855. | Duquesnoy, Dinh, et al., 2006 | 50. m/0.22 mm/0.25 μm, He, 2. K/min, 220. C @ 20. min; Tstart: 60. C |
Capillary | DB-Wax | 1889. | Gurbuz O., Rouseff J.M., et al., 2006 | 60. m/0.25 mm/0.25 μm, He, 7. K/min, 265. C @ 5. min; Tstart: 40. C |
Capillary | DB-Wax | 1865. | Gurbuz O., Rouseff J.M., et al., 2006 | 30. m/0.32 mm/0.5 μm, He, 7. K/min, 265. C @ 5. min; Tstart: 40. C |
Capillary | DB-Wax | 1864. | Lopez-Galilea I., Fournier N., et al., 2006 | 30. m/0.32 mm/0.5 μm, He, 5. K/min, 240. C @ 10. min; Tstart: 40. C |
Capillary | DB-Wax | 1864. | Lopez-Galilea I., Fournier N., et al., 2006 | 30. m/0.32 mm/0.5 μm, He, 5. K/min, 240. C @ 10. min; Tstart: 40. C |
Capillary | CP-Wax 52CB | 1861. | Mahadevan and Farmer, 2006 | 60. C @ 5. min, 4. K/min, 220. C @ 30. min; Column length: 50. m; Column diameter: 0.32 mm |
Capillary | CP-Wax 52CB | 1861. | Mahadevan and Farmer, 2006 | 60. C @ 5. min, 4. K/min, 220. C @ 30. min; Column length: 50. m; Column diameter: 0.32 mm |
Capillary | CP-Wax 52CB | 1849. | Mahadevan and Farmer, 2006 | 60. C @ 5. min, 4. K/min, 220. C @ 30. min; Column length: 50. m; Column diameter: 0.32 mm |
Capillary | DB-Wax | 1823. | Osorio, Alarcon, et al., 2006 | 30. m/0.25 mm/0.25 μm, He, 50. C @ 4. min, 4. K/min, 220. C @ 20. min |
Capillary | DB-FFAP | 1875. | Zeller and Rychlik, 2006 | 30. m/0.32 mm/0.25 μm, He, 40. C @ 1. min, 6. K/min; Tend: 230. C |
Capillary | OV-351 | 1815. | Bonvehí, 2005 | 50. m/0.32 mm/0.2 μm, He, 5. K/min; Tstart: 60. C; Tend: 220. C |
Capillary | Supelcowax-10 | 1823. | Chung, Fung, et al., 2005 | 60. m/0.25 mm/0.25 μm, 35. C @ 5. min, 6. K/min, 195. C @ 60. min |
Capillary | Stabilwax | 1872. | Fang and Qian, 2005 | 30. m/0.32 mm/1. μm, N2, 40. C @ 2. min, 4. K/min, 230. C @ 10. min |
Capillary | DB-Wax | 1868. | Gocmen, Elston, et al., 2005 | 30. m/0.32 mm/0.5 μm, 7. K/min, 240. C @ 5. min; Tstart: 40. C |
Capillary | DB-Wax | 1868. | Gocmen, Elston, et al., 2005 | 30. m/0.32 mm/0.5 μm, 7. K/min, 240. C @ 5. min; Tstart: 40. C |
Capillary | Innowax | 1871. | Lee, Lee, et al., 2005 | 50. m/0.25 mm/0.25 μm, He, 50. C @ 3. min, 2. K/min, 220. C @ 20. min |
Capillary | ZB-Wax | 1855. | Ledauphin, Saint-Clair, et al., 2004 | 30. m/0.25 mm/0.15 μm, He, 35. C @ 5. min, 5. K/min, 220. C @ 10. min |
Capillary | DB-Wax | 1872. | Högnadóttir and Rouseff, 2003 | 30. m/0.32 mm/0.5 μm, 7. K/min, 240. C @ 5. min; Tstart: 40. C |
Capillary | DB-FFAP | 1840. | Karagül-Yüceer, Vlahovich, et al., 2003 | 30. m/0.25 mm/0.25 μm, He, 35. C @ 5. min, 10. K/min, 200. C @ 30. min |
Capillary | Supelcowax-10 | 1867. | Chung, Yung, et al., 2002 | 60. m/0.25 mm/0.25 μm, He, 35. C @ 5. min, 2. K/min, 195. C @ 90. min |
Capillary | Supelcowax-10 | 1849. | Moreira, Trugo, et al., 2002 | 30. m/0.25 mm/0.25 μm, He, 3. K/min, 230. C @ 30. min; Tstart: 50. C |
Capillary | DB-Wax | 1873. | Wu and Cadwallader, 2002 | 30. m/0.32 mm/1. μm, He, 40. C @ 5. min, 10. K/min, 200. C @ 30. min |
Capillary | Supelcowax-10 | 1867. | Chung, Yung, et al., 2001 | 60. m/0.25 mm/0.25 μm, He, 35. C @ 5. min, 2. K/min, 195. C @ 90. min |
Capillary | DB-Wax | 1859. | Kim, 2001 | 60. m/0.25 mm/0.25 μm, He, 40. C @ 5. min, 2. K/min, 200. C @ 30. min |
Capillary | DB-Wax | 1872. | Lee, Suriyaphan, et al., 2001 | 60. m/0.25 mm/0.25 μm, He, 2. K/min; Tstart: 40. C; Tend: 200. C |
Capillary | DB-Wax | 1840. | Wirth, Guo, et al., 2001 | 30. m/0.32 mm/0.5 μm, He, 60. C @ 3. min, 3. K/min, 245. C @ 20. min |
Capillary | DB-Wax | 1850. | Bureau, Baumes, et al., 2000 | 30. m/0.32 mm/0.5 μm, He, 60. C @ 3. min, 3. K/min, 245. C @ 20. min |
Capillary | Supelcowax-10 | 1868. | Chung, 2000 | 60. m/0.25 mm/0.25 μm, He, 2. K/min, 195. C @ 90. min; Tstart: 35. C |
Capillary | CP-Wax 52CB | 1856. | Chevance and Farmer, 1999 | 60. C @ 5. min, 4. K/min, 220. C @ 30. min; Column length: 50. m; Column diameter: 0.32 mm |
Capillary | CP-Wax 52CB | 1849. | Chevance and Farmer, 1999 | 60. C @ 5. min, 4. K/min, 220. C @ 30. min; Column length: 50. m; Column diameter: 0.32 mm |
Capillary | CP-Wax 52CB | 1852. | Chevance and Farmer, 1999, 2 | 40. C @ 5. min, 4. K/min, 220. C @ 30. min; Column length: 50. m; Column diameter: 0.32 mm |
Capillary | CP-Wax 52CB | 1850. | Chevance and Farmer, 1999, 2 | 60. C @ 5. min, 4. K/min, 220. C @ 30. min; Column length: 50. m; Column diameter: 0.32 mm |
Capillary | CP-Wax 52CB | 1851. | Chevance and Farmer, 1999, 2 | 40. C @ 5. min, 4. K/min, 220. C @ 30. min; Column length: 50. m; Column diameter: 0.32 mm |
Capillary | Supelcowax-10 | 1867. | Chung, 1999 | 60. m/0.25 mm/0.25 μm, He, 35. C @ 5. min, 2. K/min, 195. C @ 90. min |
Capillary | DB-Wax | 1894. | Ott, Fay, et al., 1997 | 60. m/0.53 mm/1. μm, He, 20. C @ 5. min, 4. K/min, 200. C @ 10. min |
Capillary | DB-Wax | 1896. | Ott, Fay, et al., 1997 | 60. m/0.53 mm/1. μm, He, 20. C @ 5. min, 4. K/min, 200. C @ 10. min |
Capillary | DB-Wax | 1896. | Ott, Fay, et al., 1997 | 60. m/0.53 mm/1. μm, He, 20. C @ 5. min, 4. K/min, 200. C @ 10. min |
Capillary | DB-Wax | 1897.5 | Ott, Fay, et al., 1997 | 60. m/0.53 mm/1. μm, He, 20. C @ 5. min, 4. K/min, 200. C @ 10. min |
Capillary | PEG-20M | 1846. | Shimoda, Nakada, et al., 1997 | 60. m/0.25 mm/0.25 μm, He, 2. K/min, 230. C @ 60. min; Tstart: 50. C |
Capillary | DB-Wax | 1846. | Shimoda, Shiratsuchi, et al., 1996 | 60. m/0.25 mm/0.25 μm, He, 2. K/min, 230. C @ 60. min; Tstart: 50. C |
Capillary | DB-Wax | 1859. | Shiratsuchi, Shimoda, et al., 1993 | 60. m/0.25 mm/0.25 μm, 50. C @ 4. min, 2. K/min, 230. C @ 30. min |
Capillary | DB-Wax | 1836. | Humpf and Schreier, 1991 | 30. m/0.25 mm/0.25 μm, He, 50. C @ 3. min, 4. K/min, 220. C @ 20. min |
Capillary | DB-Wax | 1829. | Suárez, Duque, et al., 1991 | 30. m/0.259 mm/0.25 μm, He, 50. C @ 3. min, 4. K/min; Tend: 240. C |
Capillary | DB-Wax | 1840. | Suárez, Duque, et al., 1991 | 30. m/0.259 mm/0.25 μm, He, 50. C @ 3. min, 4. K/min; Tend: 240. C |

Van Den Dool and Kratz RI, polar column, custom temperature program

Column type | Active phase | I | Reference | Comment |
---|---|---|---|---|
Capillary | DB-Wax | 1882. | Escudero, Campo, et al., 2007 | 30. m/0.32 mm/0.5 μm, H2; Program: 40C(5min) => 4C/min => 100C6C/min => 136C => 3C/min => 220C (10min) |
Capillary | FFAP | 1857. | Frauendorfer and Schieberle, 2006 | 25. m/0.32 mm/0.2 μm, He; Program: 40C(1min) => 40C/min => 60C(1min) => 6C/min => 180C => 15C/min => 240C |
Capillary | Stabilwax | 1875. | Natali N., Chinnici F., et al., 2006 | 30. m/0.25 mm/0.25 μm, He; Program: 40C => 3C/min => 100C => 5C/min => 240C(10min) |
Capillary | FFAP | 1859. | Schuh and Schieberle, 2006 | 30. m/0.32 mm/0.25 μm; Program: 40C(2min) => 6C/min => 150C => 20C/min => 230C |
Capillary | SOLGel-Wax | 1826. | Aubert, Baumann, et al., 2005 | 30. m/0.25 mm/0.25 μm, He; Program: 35C(5min) => 3C/min => 150C => 5C/min => 250C (10min) |
Capillary | FFAP | 1870. | Fritsch and Schieberle, 2005 | 30. m/0.32 mm/0.25 μm, He; Program: 35C(2min) => 40C/min => 60C(2min) => 6C/min => 180C => 20C/min => 230C(10min) |
Capillary | FFAP | 1858. | Jezussek, Juliano, et al., 2002 | 30. m/0.25 mm/0.25 μm, He; Program: 40C(1min) => 40C/min => 50C(2min) => 6C/min => 240C |
Capillary | DB-Wax | 1838. | Cantergiani, Brevard, et al., 2001 | 30. m/0.25 mm/0.25 μm; Program: 20C(30s) => fast => 60C => 4C/min => 220C (20min) |
Capillary | DB-FFAP | 1875. | Munk, Johansen, et al., 2001 | 30. m/0.32 mm/0.25 μm; Program: 40C(2min) => 40C/min => 60C (2min) => 6C/min => 180C => 10C/min => 240C(5min) |
Capillary | DB-FFAP | 1833. | Munk, Munch, et al., 2000 | 30. m/0.32 mm/0.25 μm; Program: 40C(2min) => 40C/min => 60C (2min) => 6C/min => 180C => 10C/min => 240C (5min) |
Capillary | DB-FFAP | 1830. | Munk, Munch, et al., 2000 | 30. m/0.32 mm/0.25 μm; Program: 40C(2min) => 40C/min => 60C (2min) => 6C/min => 180C => 10C/min => 240C (5min) |
Capillary | FFAP | 1860. | Derail, Hofmann, et al., 1999 | 30. m/0.32 mm/0.25 μm, He; Program: 35C (2min) => 40C/min => 60C => 4C/min => 230C (10min) |
Capillary | FFAP | 1878. | Jagella and Grosch, 1999 | 30. m/0.32 mm/0.25 μm, He; Program: 40C(1min) => 40C/min => 60C => 6C/min => 230C |
Capillary | FFAP | 1875. | Fickert and Schieberle, 1998 | 25. m/0.32 mm/0.5 μm, He; Program: 35C (2min) => 40C/min => 60C => 6C/min => 230C (10min) |
Capillary | FFAP | 1840. | Münch, Hofmann, et al., 1997 | 30. m/0.32 mm/0.25 μm, He; Program: 40C (2min) => 40C/min => 60C (2min) => 240C (10min) |
Capillary | Supelcowax-10 | 1873. | Sing, Smadja, et al., 1992 | 60. m/0.25 mm/0.25 μm, He; Program: 20C(0.5min) => 60C => 4C/min => 250C |
Capillary | Carbowax 20M | 1851. | Whitfield, Shea, et al., 1981 | Column length: 150. m; Column diameter: 0.75 mm; Program: not specified |

Normal alkane RI, non-polar column, temperature ramp

Column type | Active phase | I | Reference | Comment |
---|---|---|---|---|
Capillary | HP-5 MS | 1088. | Fanaro, Duarte, et al., 2012 | 30. m/0.25 mm/0.25 μm, Helium, 50. C @ 0.5 min, 5. K/min, 250. C @ 0.5 min |
Capillary | VF-5 MS | 1093. | Souza, Re-Poppi, et al., 2012 | 30. m/0.25 mm/0.25 μm, Helium, 60. C @ 1. min, 6. K/min, 280. C @ 3. min |
Capillary | VF-5 MS | 1087. | Leffingwell and Alford, 2011 | 60. m/0.32 mm/0.25 μm, Helium, 2. K/min, 260. C @ 28. min; Tstart: 30. C |
Capillary | VF-5 MS | 1088. | Leffingwell and Alford, 2011 | 60. m/0.32 mm/0.25 μm, Helium, 2. K/min, 260. C @ 28. min; Tstart: 30. C |
Capillary | VF-5 MS | 1090. | Liu, Lu, et al., 2011 | 30. m/0.25 mm/0.25 μm, Helium, 40. C @ 3. min, 5. K/min, 250. C @ 3. min |
Capillary | DB-5 MS | 1110. | Majcher, Lawrowski, et al., 2010 | 25. m/0.20 mm/0.33 μm, Helium, 40. C @ 1. min, 10. K/min; Tend: 250. C |
Capillary | ZB-5 | 1096. | Harrison and Priest, 2009 | 30. m/0.25 mm/0.25 μm, Helium, 40. C @ 1. min, 6. K/min, 280. C @ 9. min |
Capillary | HP-5 MS | 1086. | Kim and Chung, 2009 | 30. m/0.25 mm/0.25 μm, Helium, 35. C @ 5. min, 2. K/min, 195. C @ 30. min |
Capillary | SE-54 | 1089. | Laselan, Buettner, et al., 2009 | 30. m/0.32 mm/0.25 μm, 0. C @ 2. min, 6. K/min; Tend: 200. C |
Capillary | RTX-5 MS | 1090. | Watcharananun, Cadwallader, et al., 2009 | 30. m/0.25 mm/0.50 μm, Helium, 35. C @ 5. min, 6. K/min, 225. C @ 10. min |
Capillary | HP-5 MS | 1089. | Zhao, Zeng, et al., 2009 | 30. m/0.25 mm/0.25 μm, Helium, 4. K/min; Tstart: 50. C; Tend: 280. C |
Capillary | HP-5 MS | 1089. | Forero, Quijano, et al., 2008 | 30. m/0.25 mm/0.25 μm, Helium, 50. C @ 4. min, 4. K/min, 230. C @ 10. min |
Capillary | SLB-5MS | 1102. | Risticevic, Carasek, et al., 2008 | 10. m/0.18 mm/0.18 μm, Helium, 40. C @ 1.5 min, 10. K/min; Tend: 295. C |
Capillary | Elite-5MS | 1084. | Tava, Pecetti, et al., 2007 | 30. m/0.32 mm/0.5 μm, He, 40. C @ 5. min, 4. K/min, 280. C @ 10. min |
Capillary | HP-1 | 1053. | Castel, Fernandez, et al., 2006 | 50. m/0.2 mm/0.33 μm, He, 60. C @ 4. min, 2. K/min, 250. C @ 30. min |
Capillary | HP-1 | 1058. | Castel, Fernandez, et al., 2006 | 50. m/0.2 mm/0.33 μm, He, 60. C @ 4. min, 2. K/min, 250. C @ 30. min |
Capillary | HP-1 | 1058. | Castel, Fernandez, et al., 2006, 2 | 50. m/0.2 mm/0.33 μm, He, 60. C @ 4. min, 2. K/min, 250. C @ 30. min |
Capillary | DB-5 | 1092. | Fadel, Mageed, et al., 2006 | He, 60. C @ 5. min, 4. K/min; Column length: 60. m; Column diameter: 0.32 mm; Tend: 250. C |
Capillary | DB-5 | 1091. | Fadel, Mageed, et al., 2006, 2 | He, 50. C @ 5. min, 4. K/min; Column length: 60. m; Column diameter: 0.32 mm; Tend: 250. C |
Capillary | HP-5MS | 1090. | Kim, Abd El-Aty, et al., 2006 | 30. m/0.25 mm/0.25 μm, He, 50. C @ 4. min, 5. K/min, 280. C @ 10. min |
Capillary | DB-5 MS | 1089. | Schirack, Drake, et al., 2006 | 30. m/0.25 mm/0.25 μm, 40. C @ 3. min, 8. K/min, 200. C @ 20. min |
Capillary | DB-5 | 1088. | de Souza, Vásquez, et al., 2006 | He, 35. C @ 3. min, 6. K/min; Column length: 13.5 m; Column diameter: 0.32 mm; Tend: 225. C |
Capillary | CP Sil 5 CB | 1083. | Tesso, König, et al., 2006 | H2, 3. K/min; Column length: 25. m; Column diameter: 0.25 mm; Tstart: 50. C; Tend: 230. C |
Capillary | ZB-5 | 1102. | Dötterl and Jürgens, 2005 | 60. m/0.25 mm/0.25 μm, He, 40. C @ 7. min, 6. K/min, 250. C @ 1. min |
Capillary | ZB-5 | 1102. | Dötterl, Wolfe, et al., 2005 | 60. m/0.25 mm/0.25 μm, He, 40. C @ 7. min, 6. K/min, 250. C @ 1. min |
Capillary | DB-1 | 1057. | Lee, Lee, et al., 2005, 2 | 60. m/0.32 mm/0.25 μm, He, 35. C @ 4. min, 2. K/min, 230. C @ 25. min |
Capillary | DB-1 | 1058. | Lee, Lee, et al., 2005, 2 | 60. m/0.32 mm/0.25 μm, He, 35. C @ 4. min, 2. K/min, 230. C @ 25. min |
Capillary | ZB-5 | 1100. | Jürgens and Dötterl, 2004 | 60. m/0.25 mm/0.25 μm, He, 40. C @ 4.6 min, 6. K/min, 260. C @ 1. min |
Capillary | DB-1 | 1053. | Park, Lee, et al., 2004 | 60. m/0.32 mm/0.25 μm, He, 35. C @ 4. min, 2. K/min, 230. C @ 25. min |
Capillary | DB-1 | 1055. | Park, Lee, et al., 2004 | 60. m/0.32 mm/0.25 μm, He, 35. C @ 4. min, 2. K/min, 230. C @ 25. min |
Capillary | DB-1 | 1056. | Park, Lee, et al., 2004 | 60. m/0.32 mm/0.25 μm, He, 35. C @ 4. min, 2. K/min, 230. C @ 25. min |
Capillary | DB-1 | 1058. | Park, Lee, et al., 2004 | 60. m/0.32 mm/0.25 μm, He, 35. C @ 4. min, 2. K/min, 230. C @ 25. min |
Capillary | DB-5 | 1074. | Sanz, Czerny, et al., 2002 | 30. m/0.32 mm/0.25 μm, He, 40. C @ 2. min, 6. K/min, 230. C @ 5. min |
Capillary | DB-5 | 1092. | Sanz, Czerny, et al., 2002 | 30. m/0.32 mm/0.25 μm, He, 40. C @ 2. min, 6. K/min, 230. C @ 5. min |
Capillary | DB-5 | 1088. | Tellez, Khan, et al., 2002 | 30. m/0.25 mm/0.25 μm, He, 3. K/min; Tstart: 60. C; Tend: 240. C |
Capillary | DB-5MS | 1097. | Cadwallader and Heo, 2001 | 30. m/0.53 mm/1.5 μm, He, 40. C @ 5. min, 6. K/min, 225. C @ 30. min |
Capillary | DB-5MS | 1089. | Lee, Suriyaphan, et al., 2001 | 60. m/0.25 mm/0.25 μm, He, 40. C @ 5. min, 2. K/min, 200. C @ 30. min |
Capillary | SPB-5 | 1095. | Poligné, Collignan, et al., 2001 | 60. m/0.32 mm/1. μm, He, 3. K/min; Tstart: 40. C; Tend: 200. C |
Capillary | DB-5MS | 1089. | Suriyaphan, Drake, et al., 2001 | 30. m/0.32 mm/0.25 μm, He, 40. C @ 5. min, 5. K/min, 195. C @ 40. min |
Capillary | DB-5 | 1090. | Kotseridis and Baumes, 2000 | 30. m/0.32 mm/0.5 μm, H2, 60. C @ 3. min, 3. K/min, 245. C @ 20. min |
Capillary | DB-5 | 1090. | Kotseridis and Baumes, 2000 | 30. m/0.32 mm/0.5 μm, H2, 60. C @ 3. min, 3. K/min, 245. C @ 20. min |
Capillary | BP-5 | 1103. | Lopez, Ferreira, et al., 1999 | 50. m/0.32 mm/1. μm, He, 40. C @ 5. min, 2. K/min; Tend: 190. C |
Capillary | HP-1 | 1056. | Ong and Acree, 1999 | 4. K/min; Column length: 25. m; Column diameter: 0.20 mm; Tstart: 35. C; Tend: 250. C |
Capillary | DB-5 | 1088. | Tellez, Canel, et al., 1999 | 30. m/0.25 mm/0.25 μm, He, 3. K/min; Tstart: 60. C; Tend: 240. C |
Capillary | OV-101 | 1066. | Deibler, Acree, et al., 1998 | 10. m/0.25 mm/0.52 μm, Helium, 35. C @ 3. min, 6. K/min; Tend: 225. C |
Capillary | BP-5 | 1103. | Ferreira, Ardanuy, et al., 1998 | 50. m/0.32 mm/1. μm, He, 40. C @ 5. min, 2. K/min; Tend: 190. C |
Capillary | DB-1 | 1057. | Kjällstrand, Ramnäs, et al., 1998 | 30. m/0.25 mm/0.25 μm, He, 5. K/min; Tstart: 50. C; Tend: 200. C |
Capillary | HP-1 | 1056. | Ong and Acree, 1998 | 4. K/min; Column length: 25. m; Column diameter: 0.32 mm; Tstart: 35. C; Tend: 250. C |
Capillary | HP-1 | 1056. | Ong, Acree, et al., 1998 | 4. K/min; Column length: 25. m; Column diameter: 0.32 mm; Tstart: 35. C; Tend: 250. C |
Capillary | DB-1 | 1058. | Buttery, Ling, et al., 1997 | 30. C @ 25. min, 4. K/min, 200. C @ 20. min; Column length: 60. m; Column diameter: 0.25 mm |
Capillary | DB-1 | 1058. | Stashenko, Torres, et al., 1995 | 60. m/0.25 mm/0.25 μm, He, 50. C @ 5. min, 3.5 K/min; Tend: 250. C |
Capillary | OV-101 | 1071. | Egolf and Jurs, 1993 | 2. K/min; Column length: 50. m; Column diameter: 0.22 mm; Tstart: 80. C; Tend: 200. C |
Packed | SE-54 | 1091. | Schieberle, 1991 | Chromosorb G AW DMCS (100-120 mesh), 50. C @ 2. min, 6. K/min, 230. C @ 10. min; Column length: 3. m |
Capillary | DB-1 | 1057. | Flath, Matsumoto, et al., 1989 | 60. m/0.32 mm/0.25 μm, 4. K/min; Tstart: 50. C; Tend: 250. C |
Capillary | DB-1 | 1057. | Flath, Matsumoto, et al., 1989 | 60. m/0.32 mm/0.25 μm, 4. K/min; Tstart: 50. C; Tend: 250. C |
Capillary | DB-1 | 1058. | Flath, Matsumoto, et al., 1989 | 60. m/0.32 mm/0.25 μm, 4. K/min; Tstart: 50. C; Tend: 250. C |
Capillary | DB-1 | 1059. | Flath, Matsumoto, et al., 1989 | 60. m/0.32 mm/0.25 μm, 4. K/min; Tstart: 50. C; Tend: 250. C |
Capillary | DB-1 | 1059. | Habu, Flath, et al., 1985 | 3. K/min; Column length: 50. m; Column diameter: 0.32 mm; Tstart: 0. C; Tend: 250. C |
Capillary | DB-1 | 1057. | Habu, Flath, et al., 1985 | 3. K/min; Column length: 50. m; Column diameter: 0.32 mm; Tstart: 50. C; Tend: 250. C |

Normal alkane RI, non-polar column, custom temperature program

Column type | Active phase | I | Reference | Comment |
---|---|---|---|---|
Capillary | CP-Sil 5 CB | 1063. | Collin, Nizet, et al., 2012 | 50. m/0.32 mm/1.20 μm, Nitrogen; Program: 36 0C 20 0C/min -> 85 0C 1 0C/min -> 145 0C 3 0C/min -> 250 0C |
Capillary | SLB-5 MS | 1087. | Mondello, 2012 | 30. m/0.25 mm/0.25 μm, Helium; Program: not specified |
Capillary | SLB-5 MS | 1090. | Mondello, 2012 | 30. m/0.25 mm/0.25 μm, Helium; Program: not specified |
Capillary | Polydimethyl siloxane with 5 % Ph groups | 1095. | Robinson, Adams, et al., 2012 | Program: not specified |
Capillary | Polydimethyl siloxane with 5 % Ph groups | 1102. | Robinson, Adams, et al., 2012 | Program: not specified |
Capillary | HP-5 MS | 1063. | Rodrigues, Hanson, et al., 2012 | 30. m/0.32 mm/0.25 μm, Helium; Program: 40 0C (1 min) 3 0C/min -> 150 0C (15 min) 5 0C/min -> 250 0C (5 min) |
Capillary | VF-5 MS | 1093. | Souza, Re-Poppi, et al., 2012 | 30. m/0.25 mm/0.25 μm, Helium; Program: not specified |
Capillary | VF-5 MS | 1090. | Liu, Lu, et al., 2011 | 30. m/0.25 mm/0.25 μm, Helium; Program: not specified |
Capillary | CP Sil-5 CB | 1063. | Bailly and Collin, 2010 | 50. m/0.32 mm/1.20 μm, Nitrogen; Program: 36 0C 20 0C/min -> 85 0C 1 0C/min -> 145 0C 3 0C/min -> 250 0C |
Capillary | DB-5 | 1086. | San-Juan, Petka, et al., 2010 | 30. m/0.32 mm/0.50 μm, Hydrogen; Program: 40 0C (5 min) 4 0C/min -> 100 0C 6 0C/min -> 220 0C (20 min) |
Capillary | CP-Sil 5 CB | 1063. | Bailly, Jerkovic, et al., 2009 | 50. m/0.32 mm/1.20 μm, Nitrogen; Program: 36 0C 20 0C/min -> 85 0C 1 0C -> 145 0C 3 0C/min -> 250 0C |
Capillary | ZB-1 MS | 1090. | Bajpai, Al-Reza, et al., 2009 | 30. m/0.25 mm/0.25 μm, Helium; Program: 50 0C 3 0C/min -> 150 0C (10 min) 10 0C/min -> 250 0C |
Capillary | SE-54 | 1089. | Christlbauer and Schieberle, 2009 | 30. m/0.32 mm/0.25 μm, Helium; Program: 35 0C (2 min) 10 0C/min -> 50 0C (2 min) 6 0C/min -> 250 0C |
Capillary | DB-5 | 1089. | Prat, Trias, et al., 2009 | 30. m/0.32 mm/0.50 μm, Hydrogen; Program: 40 0C 2 0C/min -> 12 0C/min -> 105 0C 6 0C/min -> 220 0C (20 min) |
Capillary | ZB-5 | 1089. | de Simon, Estruelas, et al., 2009 | 30. m/0.25 mm/0.25 μm, Helium; Program: 45 0C 3 0C/min -> 230 0C (10 min) 10 0C/min -> 270 0C (21 min) |
Capillary | CP-Sil 5 Cb | 1064. | Collin, Nizet, et al., 2008 | 50. m/0.32 mm/1.20 μm, Nitrogen; Program: 40 0C 20 0C/min -> 85 0C 1 0C/min -> 145 0C 3 0C/min -> 250 0C (30 min) |
Capillary | SE-54 | 1087. | Frauendorfer and Schieberle, 2008 | Helium; Program: not specified |
Capillary | SLB-5MS | 1104. | Risticevic, Carasek, et al., 2008 | 10. m/0.18 mm/0.18 μm, Helium; Program: not specified |
Capillary | HP-5 | 1090. | Zhao, Li, et al., 2008 | 30. m/0.25 mm/0.25 μm; Program: 40 0C (2 min) 5 0C/min -> 80 0C 7 oC/min -> 160 0C 9 0C/min -> 200 0C 20 0C/min -> 280 0C (10 min) |
Capillary | HP-5 | 1088. | Zhao, Li, et al., 2008 | 30. m/0.25 mm/0.25 μm; Program: not specified |
Capillary | DB-5 MS | 1056. | Zhu, Li, et al., 2008 | 30. m/0.25 mm/0.25 μm, Helium; Program: 50 0C (2.8 min) 5.5 0C/min -> 140 0C (1 min) 4.5 oC/min -> 220 0C -> 225 0C (2 min) 3.4 0C/min -> 265 0C (5 min) |
Capillary | DB-5 MS | 1082. | Zhu, Li, et al., 2008 | 30. m/0.25 mm/0.25 μm, Helium; Program: 50 0C (2.8 min) 5.5 0C/min -> 140 0C (1 min) 4.5 oC/min -> 220 0C -> 225 0C (2 min) 3.4 0C/min -> 265 0C (5 min) |
Capillary | DB-5 MS | 1094. | Cajka, Hajslova, et al., 2007 | 30. m/0.25 mm/0.25 μm, Helium; Program: 45 0C (0.75 min) 10 0C/min -> 200 0C 30 0C/min -> 245 0C (1.25 min) |
Capillary | DB-5 | 1095. | Greger and Schieberle, 2007 | 30. m/0.25 mm/0.25 μm, He; Program: 40C(1min) => 7C/min => 110C => 5C/min => 180C => 10C/min => 240C(10min) |
Capillary | SE-54 | 1089. | Lasekan, Buettner, et al., 2007 | 30. m/0.32 mm/0.25 μm; Program: 35C(2min) => 40C/min => 60C(2min) => 6C/min => 180C => 10C/min => 230C(10min) |
Capillary | Polydimethyl siloxane | 1057. | RAyne and Eggers, 2007 | Program: not specified |
Capillary | CP-Sil 5 CB | 1063. | Bailly, Jerkovic, et al., 2006 | 50. m/0.32 mm/1.20 μm, Helium; Program: 36 0C 20 0C/min -> 85 0C 1 0C/min -> 1345 0C 3 0C/min -> 250 0C |
Capillary | CP Sil 5 CB | 1063. | Bailly, Jerkovic, et al., 2006, 2 | 50. m/0.32 mm/1.2 μm, He; Program: 36C => 20C/min => 85C => 1C/min => 145C => 3C/min => 250C |
Capillary | HP-5 | 1086. | Baroni, Nores, et al., 2006 | 26. m/0.2 mm/0.25 μm, He; Program: 60C(5min) => 6C/min => 200C => 15C/min => 250C(5min) |
Capillary | HP-5MS | 1089. | Li, Deng, et al., 2006 | 30. m/0.25 mm/0.25 μm, He; Program: 40C(1min) => 8C/min => 160C => 12C/min => 300C(5min) |
Capillary | CP-Sil5 CB MS | 1064. | Iraqi, Vermeulen, et al., 2005 | 50. m/0.32 mm/1.2 μm; Program: 36C(2min) => 20C/min => 85C => 1C/min => 145C => 3C/min => 250C(30min) |
Capillary | Polydimethyl siloxane with 5 % Ph groups | 1087. | Pino, Marbot, et al., 2005 | Program: not specified |
Capillary | DB-5 | 1088. | Steinhaus and Schieberle, 2005 | 30. m/0.32 mm/0.25 μm, He; Program: 40 0C (2 min) 6 K/min -> 190 0C 12 K/min -> 240 0C |
Capillary | SE-54 | 1089. | Buettner, 2004 | 30. m/0.32 mm/0.25 μm, He; Program: 40C(2min) => 40C/min => 50C(2min) => 6C/min => 180C => 15C/min => 230C (10min) |
Capillary | MFE-73 | 1086. | Escudero, Gogorza, et al., 2004 | Program: not specified |
Capillary | DB-5 | 1074. | Hamm, Bleton, et al., 2004 | 30. m/0.25 mm/0.25 μm, He; Program: 40C(1min) => 9C/min => 130C => 2C/min => 230C |
Capillary | SE-30 | 1071. | Vinogradov, 2004 | Program: not specified |
Capillary | HP-5MS | 1088. | Martí, Mestres, et al., 2003 | 30. m/0.25 mm/0.25 μm, He; Program: 40C(5min) => 2C/min => 120C => 10C/min => 210C (30min) |
Capillary | DB-5 | 1096. | Bücking and Steinhart, 2002 | 30. m/0.53 mm/1.5 μm; Program: -5C(1min) => 4C/min => 50C => 6C/min => 120C => 8C/min => 250C(2min) |
Capillary | CP Sil 5 CB | 1063. | Counet, Callemien, et al., 2002 | 50. m/0.32 mm/1.2 μm; Program: 36C => 20C/min => 85C => 1C/min => 145C=3C/min => 250C(30min) |
Capillary | MFE-73 | 1086. | Ferreira, Ortín, et al., 2002 | H2; Program: not specified |
Capillary | Methyl phenyl siloxane (not specified) | 1096. | Poligne, Collignan, et al., 2002 | Program: not specified |
Capillary | HP-5MS | 1089. | Ansorena, Gimeno, et al., 2001 | 30. m/0.25 mm/0.25 μm, He; Program: 40C (10min) => 3C/min => 120C => 10C/min => 250C (5min) |
Capillary | MFE-73 | 1086. | Aznar, López, et al., 2001 | 30. m/0.32 mm/0.1 μm, H2; Program: 40C(5min) => 2C/min => 120C => 10C/min => 210C(30min) |
Capillary | MFE-73 | 1086. | Ferreira, Aznar, et al., 2001 | 30. m/0.32 mm/0.1 μm, H2; Program: 40 C (5min) => 2C/min => 120C => 10 C/min => 210 C (30min) |
Capillary | CP Sil 5 CB | 1066. | Lermusieau, Bulens, et al., 2001 | 50. m/0.32 mm/1.2 μm; Program: 36C => 20C/min => 120C(20min) => 2C/min => 250C(30min) |
Capillary | HP-5 | 1087. | Ansorena, Astiasarán, et al., 2000 | 30. m/0.25 mm/0.25 μm, He; Program: 40C (10min) => 3C/min => 120C => 10C/min => 250C (5min) |
Capillary | CP Sil 5 CB | 1071. | Guyot, Bouseta, et al., 1998 | 50. m/0.32 mm/1.2 μm, He; Program: 30C => 55C/min => 85C => 1C/min => 145C => 3C/min => 250C |
Capillary | OV-101 | 1058. | Licker, Acree, et al., 1998 | Program: not specified |
Capillary | DB-5 | 1095. | Matsui, Guth, et al., 1998 | 30. m/0.32 mm/0.25 μm, He; Program: 35C(1min) => 40C/min => 60C (1min) => 6C/min => 230C |
Capillary | SE-54 | 1090. | Reiners and Grosch, 1998 | 30. m/0.32 mm/0.25 μm; Program: 35 0C (2 min) 40 0C/min -> 50 0C (1 min) 6 0C/min -> 230 0C |
Capillary | DB-5 | 1090. | Guth, 1997 | 30. m/0.32 mm/0.25 μm; Program: 35C (1min) => 40C/min => 60C (1min) => 6C/min => 250C (10min) |
Capillary | SE-54 | 1099. | Lizárraga-Guerra, Guth, et al., 1997 | He; Column length: 30. m; Column diameter: 0.32 mm; Program: 35C => 40C/min => 60C (1min) => 6C/min => 250C |
Capillary | DB-5 | 1092. | Schieberle, 1996 | Column length: 30. m; Column diameter: 0.32 mm; Program: not specified |
Capillary | DB-5 | 1088. | Schieberle and Grosch, 1994 | He; Column length: 30. m; Column diameter: 0.32 mm; Program: 35C => 40C/min => 50C(2min) => 4C/min => 240C |
Capillary | SE-54 | 1093. | Blank, Sen, et al., 1992 | Program: not specified |
Capillary | SE-30 | 1095. | Peterson, 1992 | Program: not specified |
Capillary | OV-101 | 1071. | Shibamoto, 1987 | Program: not specified |
Capillary | OV-1, SE-30, Methyl silicone, SP-2100, OV-101, DB-1, etc. | 1077. | Waggott and Davies, 1984 | Hydrogen; Column length: 50. m; Column diameter: 0.32 mm; Program: not specified |
Other | Methyl Silicone | 1092. | Ardrey and Moffat, 1981 | Program: not specified |

Normal alkane RI, polar column, temperature ramp

Column type | Active phase | I | Reference | Comment |
---|---|---|---|---|
Capillary | HP-FFAP | 1890. | Wanakhachornkrai and Lertsiri, 9999 | 25. m/0.32 mm/0.50 μm, Helium, 15. K/min; Tstart: 45. C; Tend: 220. C |
Capillary | HP-FFAP | 1893. | Wanakhachornkrai and Lertsiri, 9999 | 25. m/0.32 mm/0.50 μm, Helium, 15. K/min; Tstart: 45. C; Tend: 220. C |
Capillary | HP-Innowax | 1869. | Puvipirom and Chaisei, 2012 | 15. m/0.32 mm/0.50 μm, Helium, 3. K/min; Tstart: 40. C; Tend: 250. C |
Capillary | DB-Wax | 1857. | Kumazawa, Sakai, et al., 2010 | 30. m/0.25 mm/0.25 μm, Helium, 3. K/min; Tstart: 40. C; Tend: 210. C |
Capillary | CP Wax 52 CB | 1862. | Birtic, Ginies, et al., 2009 | 30. m/0.32 mm/0.50 μm, Helium, 40. C @ 2. min, 4. K/min, 230. C @ 15. min |
Capillary | CP Wax 52 CB | 1862. | Birtic, Ginies, et al., 2009 | 30. m/0.32 mm/0.50 μm, Helium, 40. C @ 2. min, 4. K/min, 230. C @ 15. min |
Capillary | FFAP | 1859. | Christlbauer and Schieberle, 2009 | 30. m/0.32 mm/0.25 μm, Helium, 40. C @ 2. min, 6. K/min; Tend: 240. C |
Capillary | DB-FFAP | 1880. | Laselan, Buettner, et al., 2009 | 30. m/0.32 mm/0.25 μm, 0. C @ 2. min, 6. K/min; Tend: 200. C |
Capillary | TC-Wax | 1863. | Miyazawa, Nakanishi, et al., 2009 | Helium, 3. K/min; Column length: 60. m; Column diameter: 0.25 mm; Tstart: 40. C; Tend: 230. C |
Capillary | CP-Wax | 1876. | Mo, Fan, et al., 2009 | 60. m/0.25 mm/0.25 μm, Helium, 50. C @ 2. min, 6. K/min, 230. C @ 15. min |
Capillary | DB-Wax | 1886. | Moon and Shibamoto, 2009 | 60. m/0.25 mm/0.50 μm, Helium, 40. C @ 5. min, 2. K/min, 210. C @ 70. min |
Capillary | Stabilwax | 1862. | Watcharananun, Cadwallader, et al., 2009 | 30. m/0.25 mm/0.50 μm, Helium, 35. C @ 5. min, 6. K/min, 225. C @ 10. min |
Capillary | DB-Wax | 1859. | Zhao, Xu, et al., 2009 | 30. m/0.25 mm/0.25 μm, Helium, 40. C @ 2. min, 3. K/min, 230. C @ 5. min |
Capillary | DB-Wax | 1885. | Caldeira, de Sousa, et al., 2008 | 30. m/0.25 mm/0.25 μm, Helium, 40. C @ 10. min, 3.5 K/min, 180. C @ 30. min |
Capillary | HP-Innowax | 1876. | Soria, Sanz, et al., 2008 | 50. m/0.20 mm/0.20 μm, Helium, 45. C @ 2. min, 4. K/min, 190. C @ 50. min |
Capillary | Supelcowax-10 | 1855. | Vichi, Romero, et al., 2008 | 30. m/0.25 mm/0.25 μm, Helium, 50. C @ 10. min, 8. K/min; Tend: 240. C |
Capillary | FFAP | 1892. | Nebesny, Budryn, et al., 2007 | 30. m/0.32 mm/0.5 μm, N2, 35. C @ 5. min, 4. K/min, 320. C @ 45. min |
Capillary | DB-FFAP | 1875. | Zeller and Rychlik, 2007 | 30. m/0.32 mm/0.25 μm, He, 40. C @ 1. min, 6. K/min; Tend: 230. C |
Capillary | DB-Wax | 1862. | Fan and Qian, 2006 | 30. m/0.32 mm/0.25 μm, N2, 40. C @ 2. min, 6. K/min, 230. C @ 15. min |
Capillary | DB-Wax Etr | 1876. | Ibarz, Ferreira, et al., 2006 | 60. m/0.25 mm/0.25 μm, He, 40. C @ 5. min, 2. K/min, 230. C @ 100. min |
Capillary | DB-Wax | 1834. | Kishimoto, Wanikawa, et al., 2006 | 15. m/0.32 mm/0.25 μm, He, 6. K/min, 230. C @ 20. min; Tstart: 40. C |
Capillary | DB-Wax Etr | 1894. | Perestrelo, Fernandes, et al., 2006 | 30. m/0.25 mm/0.25 μm, He, 40. C @ 1. min, 2. K/min, 220. C @ 10. min |
Capillary | DB-Wax | 1825. | Schirack, Drake, et al., 2006 | 30. m/0.25 mm/0.25 μm, 40. C @ 3. min, 8. K/min, 200. C @ 20. min |
Capillary | DB-Wax | 1860. | Lee, Umano, et al., 2005 | 30. m/0.25 mm/0.25 μm, He, 3. K/min, 180. C @ 40. min; Tstart: 50. C |
Capillary | PEG-20M | 1877. | Yao, Guo, et al., 2005 | 60. C @ 10. min, 3. K/min, 180. C @ 30. min; Column length: 30. m; Column diameter: 0.25 mm |
Capillary | DB-Wax | 1883. | Culleré, Escudero, et al., 2004 | 30. m/0.32 mm/0.5 μm, H2, 40. C @ 5. min, 4. K/min; Tend: 200. C |
Capillary | TC-Wax | 1863. | Ishikawa, Ito, et al., 2004 | 60. m/0.25 mm/0.5 μm, He, 40. C @ 8. min, 3. K/min; Tend: 230. C |
Capillary | DB-Wax | 1879. | López, Ezpeleta, et al., 2004 | 60. m/0.25 mm/0.25 μm, He, 40. C @ 5. min, 3. K/min; Tend: 220. C |
Capillary | DB-Wax | 1831. | Akiyama, Murakami, et al., 2003 | 60. m/0.32 mm/0.25 μm, He, 6. K/min, 230. C @ 20. min; Tstart: 40. C |
Capillary | DB-Wax | 1853. | Lee and Noble, 2003 | 30. m/0.25 mm/0.25 μm, He, 40. C @ 4. min, 4. K/min, 185. C @ 20. min |
Capillary | DB-Wax | 1884. | López, Ortín, et al., 2003 | 30. m/0.32 mm/0.5 μm, H2, 40. C @ 5. min, 4. K/min; Tend: 200. C |
Capillary | TC-Wax | 1869. | Miyazawa and Okuno, 2003 | He, 4. K/min, 250. C @ 30. min; Column length: 60. m; Column diameter: 0.25 mm; Tstart: 80. C |
Capillary | DB-Wax | 1861. | Tanaka, Yamauchi, et al., 2003 | 30. m/0.25 mm/0.25 μm, 30. C @ 1. min, 4. K/min; Tend: 250. C |
Capillary | DB-Wax | 1862. | Tanaka, Yamauchi, et al., 2003 | 30. m/0.25 mm/0.25 μm, 30. C @ 1. min, 4. K/min; Tend: 250. C |
Capillary | HP-FFAP | 1893. | Wanakhachornkrai and Lertsiri, 2003 | 25. m/0.32 mm/0.5 μm, He, 15. K/min; Tstart: 45. C; Tend: 220. C |
Capillary | HP-FFAP | 1890. | Wanakhachornkrai and Lertsiri, 2003 | 25. m/0.32 mm/0.5 μm, He, 15. K/min; Tstart: 45. C; Tend: 220. C |
Capillary | DB-Wax | 1880. | Ferreira, Ortín, et al., 2002 | 30. m/0.32 mm/0.5 μm, H2, 40. C @ 5. min, 4. K/min; Tend: 200. C |
Capillary | DB-Wax | 1872. | Ito, Sugimoto, et al., 2002 | 60. C @ 4. min, 3. K/min; Column length: 60. m; Column diameter: 0.25 mm; Tend: 180. C |
Capillary | DB-Wax | 1864. | Kumazawa and Masuda, 2002 | 30. m/0.25 mm/0.25 μm, He, 5. K/min; Tstart: 40. C; Tend: 210. C |
Capillary | DB-Wax | 1863. | Kumazawa and Masuda, 2002 | 60. m/0.25 mm/0.25 μm, He, 5. K/min; Tstart: 40. C; Tend: 210. C |
Capillary | DB-Wax | 1846. | Osorio, Duque, et al., 2002 | 30. m/0.25 mm/0.25 μm, He, 50. C @ 4. min, 4. K/min, 220. C @ 20. min |
Capillary | DB-Wax | 1847. | Osorio, Duque, et al., 2002 | 30. m/0.25 mm/0.25 μm, He, 50. C @ 4. min, 4. K/min, 220. C @ 20. min |
Capillary | DB-FFAP | 1857. | Sanz, Czerny, et al., 2002 | 30. m/0.32 mm/0.25 μm, He, 40. C @ 2. min, 6. K/min, 230. C @ 5. min |
Capillary | DB-Wax | 1875. | Aznar, López, et al., 2001 | 30. m/0.32 mm/0.5 μm, H2, 40. C @ 5. min, 4. K/min, 200. C @ 60. min |
Capillary | DB-Wax | 1863. | Cadwallader and Heo, 2001 | 30. m/0.53 mm/1. μm, He, 40. C @ 5. min, 6. K/min, 225. C @ 30. min |
Capillary | DB-Wax | 1875. | Ferreira, Aznar, et al., 2001 | 30. m/0.32 mm/0.5 μm, H2, 40. C @ 5. min, 4. K/min, 200. C @ 60. min |
Capillary | DB-FFAP | 1854. | Suriyaphan, Drake, et al., 2001 | 30. m/0.32 mm/0.25 μm, He, 40. C @ 5. min, 5. K/min, 195. C @ 40. min |
Capillary | DB-Wax | 1847. | Kotseridis and Baumes, 2000 | 30. m/0.32 mm/0.5 μm, H2, 60. C @ 3. min, 3. K/min, 245. C @ 20. min |
Capillary | DB-Wax | 1847. | Kotseridis and Baumes, 2000 | 30. m/0.32 mm/0.5 μm, H2, 60. C @ 3. min, 3. K/min, 245. C @ 20. min |
Capillary | DB-Wax | 1840. | Morales, Duque, et al., 2000 | 25. m/0.25 mm/0.25 μm, He, 50. C @ 4. min, 4. K/min, 200. C @ 10. min |
Capillary | DB-Wax | 1840. | Morales, Duque, et al., 2000 | 25. m/0.25 mm/0.25 μm, He, 50. C @ 4. min, 4. K/min, 200. C @ 10. min |
Capillary | DB-Wax | 1848. | Morales, Duque, et al., 2000 | 25. m/0.25 mm/0.25 μm, He, 50. C @ 4. min, 4. K/min, 200. C @ 10. min |
Capillary | DB-Wax | 1857. | Morales, Duque, et al., 2000 | 25. m/0.25 mm/0.25 μm, He, 50. C @ 4. min, 4. K/min, 200. C @ 10. min |
Capillary | DB-Wax | 1855. | Buttery, Orts, et al., 1999 | 30. C @ 4. min, 2. K/min, 170. C @ 60. min; Column length: 60. m; Column diameter: 0.32 mm |
Capillary | DB-Wax | 1868. | Kumazawa and Masuda, 1999 | 30. m/0.53 mm/1. μm, 5. K/min; Tstart: 40. C; Tend: 210. C |
Capillary | DB-Wax | 1869. | Kumazawa and Masuda, 1999 | 60. m/0.25 mm/0.25 μm, 5. K/min; Tstart: 40. C; Tend: 210. C |
Capillary | Carbowax 20M | 1882. | Lopez, Ferreira, et al., 1999 | 60. m/0.32 mm/0.5 μm, He, 40. C @ 5. min, 2. K/min; Tend: 190. C |
Capillary | HP-Innowax | 1848. | Ong and Acree, 1999 | 4. K/min; Column length: 25. m; Column diameter: 0.25 mm; Tstart: 35. C; Tend: 250. C |
Capillary | DB-Wax | 1851. | Umano, Nakahara, et al., 1999 | 60. m/0.25 mm/0.25 μm, He, 40. C @ 2. min, 2. K/min; Tend: 200. C |
Capillary | DB-Wax | 1855. | Buttery and Ling, 1998 | 30. C @ 4. min, 2. K/min, 170. C @ 30. min; Column length: 60. m; Column diameter: 0.25 mm |
Capillary | Carbowax 20M | 1882. | Ferreira, Ardanuy, et al., 1998 | 60. m/0.32 mm/0.5 μm, He, 40. C @ 5. min, 2. K/min; Tend: 190. C |
Capillary | Carbowax 20M | 1882. | Ferreira, Ardanuy, et al., 1998 | 60. m/0.32 mm/0.5 μm, He, 40. C @ 5. min, 2. K/min; Tend: 190. C |
Capillary | Carbowax 20M | 1882. | Ferreira, Lopez, et al., 1998 | 60. m/0.32 mm/0.5 μm, He, 40. C @ 5. min, 2. K/min; Tend: 190. C |
Capillary | HP-Innowax | 1848. | Ong and Acree, 1998 | 4. K/min; Column length: 25. m; Column diameter: 0.32 mm; Tstart: 35. C; Tend: 250. C |
Capillary | HP-Innowax | 1848. | Ong, Acree, et al., 1998 | 4. K/min; Column length: 25. m; Column diameter: 0.32 mm; Tstart: 35. C; Tend: 250. C |
Capillary | TC-Wax | 1865. | Shuichi, Masazumi, et al., 1996 | 80. C @ 5. min, 3. K/min; Column length: 60. m; Column diameter: 0.25 mm; Tend: 240. C |
Capillary | Carbowax 20M | 1840. | Egolf and Jurs, 1993 | 2. K/min; Column length: 80. m; Column diameter: 0.2 mm; Tstart: 70. C; Tend: 170. C |
Capillary | Carbowax 20M | 1815. | Kawakami, Kobayashi, et al., 1993 | He, 60. C @ 4. min, 2. K/min; Column length: 50. m; Column diameter: 0.25 mm; Tend: 180. C |
Capillary | DB-Wax | 1859. | Shimoda, Shiratsuchi, et al., 1993 | 60. m/0.25 mm/0.25 μm, He, 50. C @ 4. min, 2. K/min; Tend: 230. C |
Capillary | DB-Wax | 1816. | Hatsuko, Kazuko, et al., 1992 | He, 60. C @ 10. min, 3. K/min; Column length: 30. m; Column diameter: 0.25 mm; Tend: 240. C |
Capillary | Carbowax 20M | 1815. | Kawakami and Kobayashi, 1991 | He, 60. C @ 4. min, 2. K/min; Column length: 50. m; Column diameter: 0.25 mm; Tend: 180. C |
Capillary | DB-Wax | 1863. | Andersen J.F., Mikolajczak K.L., et al., 1987 | Helium, 40. C @ 1. min, 6. K/min; Column length: 30. m; Column diameter: 0.32 mm; Tend: 200. C |
Capillary | Carbowax 20M | 1830. | Buttery, Ling, et al., 1987 | 60. C @ 40. min, 1. K/min; Column length: 150. m; Column diameter: 0.66 mm; Tend: 170. C |
Capillary | Carbowax 20M | 1840. | Buttery, Ling, et al., 1983 | 50. C @ 30. min, 1. K/min, 170. C @ 60. min; Column length: 150. m; Column diameter: 0.64 mm |

Normal alkane RI, polar column, custom temperature program

Column type | Active phase | I | Reference | Comment |
---|---|---|---|---|
Capillary | FFAP-CB | 1873. | Collin, Nizet, et al., 2012 | 25. m/0.32 mm/0.30 μm, Nitrogen; Program: 36 0C 20 0C/min -> 85 0C 1 0C/min -> 145 0C 3 0C/min -> 220 0C |
Capillary | DB-Wax | 1858. | Gyawali and Kim, 2012 | 60. m/0.20 mm/0.25 μm, Helium; Program: 40 0C (3 min) 2 0C/min -> 150 0C 4 0C/min -> 220 0C (20 min) 5 0C/min -> 230 0C |
Capillary | DB-Wax | 1877. | Welke, Manfroi, et al., 2012 | 30. m/0.25 mm/0.25 μm, Helium; Program: not specified |
Capillary | DB-Wax | 1889. | Welke, Manfroi, et al., 2012 | 30. m/0.25 mm/0.25 μm, Helium; Program: not specified |
Capillary | HP-Innowax | 1884. | Xiao, Dai, et al., 2011 | 60. m/0.25 mm/0.25 μm, Helium; Program: 40 0C (2 min) 3 0C/min -> 150 0C 5 0C/min -> 220 0C (5 min) |
Capillary | FFAP | 1873. | Bailly and Collin, 2010 | 25. m/0.32 mm/0.30 μm, Nitrogen; Program: 36 0C 20 0C/min -> 85 0C 1 0C/min -> 145 0C 3 0C/min -> 250 0C |
Capillary | DB-Wax | 1864. | San-Juan, Petka, et al., 2010 | 30. m/0.32 mm/0.50 μm, Hydrogen; Program: 40 0C (5 min) 4 0C/min -> 100 0C 6 0C/min -> 220 0C (20 min) |
Capillary | FFAP | 1873. | Bailly, Jerkovic, et al., 2009 | 25. m/0.32 mm/0.30 μm, Nitrogen; Program: 36 0C 20 0C/min -> 85 0C 1 0C -> 145 0C 3 0C/min -> 230 0C |
Capillary | Stabilwax | 1875. | Chinnici, Guerrero, et al., 2009 | 30. m/0.25 mm/0.25 μm, Helium; Program: 35 0C 3 0C/min -> 100 0C 5 0C/min -> 240 0C (10 min) |
Capillary | DB-Wax | 1864. | Ferreira, Juan, et al., 2009 | 30. m/0.32 mm/0.50 μm; Program: 40 0C (5 min) 4 0C/min -> 100 0C 6 0C/min -> 220 0C (40 min) |
Capillary | DB-Wax | 1876. | Loscos, Hernandez-Orte, et al., 2009 | 60. m/0.25 mm/0.50 μm, Helium; Program: 40 0C (3 min) 10 0C/min -> 90 0C 2 0C/min -> 230 0C (37 min) |
Capillary | DB-Wax | 1875. | Prat, Trias, et al., 2009 | 30. m/0.32 mm/0.50 μm, Hydrogen; Program: 40 0C 2 0C/min -> 12 0C/min -> 105 0C 6 0C/min -> 220 0C (20 min) |
Capillary | Supelcowax-10 | 1833. | de Simon, Estruelas, et al., 2009 | 30. m/0.25 mm/0.25 μm, Helium; Program: 45 0C 3 0C/min -> 230 0C (10 min) 10 0C/min -> 270 0C (21 min) |
Capillary | HP Innowax FSP | 1878. | Wedge, Klun, et al., 2009 | 60. m/0.25 mm/0.25 μm, Helium; Program: 60 0C (10 min) 4 0C/min -> 220 0C (10 min) 1 0C/min -> 240 0C (20 min) |
Capillary | DB-Wax | 1855. | Zhao, Xu, et al., 2009 | 30. m/0.25 mm/0.25 μm, Helium; Program: not specified |
Capillary | FFAP | 1837. | Frauendorfer and Schieberle, 2008 | Helium; Program: not specified |
Capillary | SOLGel-Wax | 1838. | Shu and Shen, 2008 | 30. m/0.53 mm/0.50 μm, Helium; Program: 40 0C 7 0C/min -> 180 0C 10 0C/min -> 240 0C (10 min) |
Capillary | SOLGel-Wax | 1843. | Shu and Shen, 2008 | 30. m/0.53 mm/0.50 μm, Helium; Program: not specified |
Capillary | DB-FFAP | 1859. | Buettner, 2007 | 30. m/0.32 mm/0.25 μm; Program: 40C(2min) => 40C/min => 60C(2min) => 6C/min => 180C => 15C/min => 230C(10min) |
Capillary | DB-Wax | 1859. | Gonzalez-Rios, Suarez-Quiroz, et al., 2007 | 30. m/0.25 mm/0.25 μm, Hydrogen; Program: 44 0C 3 0C/min -> 170 0C 8 0C/min -> 250 0C |
Capillary | DB-Wax | 1843. | Gonzalez-Rios, Suarez-Quiroz, et al., 2007 | 30. m/0.25 mm/0.25 μm, Hydrogen; Program: not specified |
Capillary | DB-FFAP | 1860. | Greger and Schieberle, 2007 | 30. m/0.32 mm/0.25 μm, He; Program: 40C(1min) => 7C/min => 180C => 10C/min => 240C (10min) |
Capillary | DB-FFAP | 1842. | Lasekan, Buettner, et al., 2007 | 30. m/0.32 mm/0.25 μm; Program: 35C(2min) => 40C/min => 50C(2min) => 6C/min => 180C => 10C/min => 230C(10min) |
Capillary | DB-Wax Etr | 1876. | Loskos, Hernandez-Orte, et al., 2007 | 60. m/0.25 mm/0.5 μm, He; Program: 40C(3min) => 10C/min => 90C => 2C/min => 230C (37min) |
Capillary | DB-Wax | 1854. | Tian, Zhang, et al., 2007 | 30. m/0.25 mm/0.25 μm, He; Program: 50 0C (2 min) 6 0C/min -> 150 0C 8 0C/min -> 230 0C (15 min) |
Capillary | HP-Innowax | 1882. | Viegas and Bassoli, 2007 | 60. m/0.32 mm/0.25 μm, Helium; Program: 40 0C (5 min) 4 0C/min -> 60 0C (5 min) 8 0C/min -> 250 0C (3 min) |
Capillary | HP-Innowax | 1859. | Viegas and Bassoli, 2007 | 60. m/0.32 mm/0.25 μm, Helium; Program: not specified |
Capillary | HP-Innowax | 1909. | Weldegergis B.T., Tredoux A.G.J., et al., 2007 | 30. m/0.25 mm/0.5 μm, He; Program: 30C(2min) => 4C/min => 130C => 8C/min => 250C(5min) |
Capillary | FFAP-CB | 1873. | Bailly, Jerkovic, et al., 2006 | 25. m/0.32 mm/0.30 μm, Helium; Program: 36 0C 20 0C/min -> 85 0C 1 0C/min -> 1345 0C 3 0C/min -> 250 0C |
Capillary | FFAP | 1873. | Bailly, Jerkovic, et al., 2006, 2 | 25. m/0.32 mm/0.3 μm, He; Program: 36C => 20C/min => 85C => 1C/min => 145C => 3C/min => 250C |
Capillary | DB-Wax | 1850. | Lee, Lee, et al., 2005, 2 | 60. m/0.32 mm/0.25 μm, He; Program: 30C(4min) => 2C/min => 170C(25min) => 10C/min => 210C(10min) |
Capillary | DB-Wax | 1855. | Lee, Lee, et al., 2005, 2 | 60. m/0.32 mm/0.25 μm, He; Program: 30C(4min) => 2C/min => 170C(25min) => 10C/min => 210C(10min) |
Capillary | DB-Wax | 1852. | Steinhaus and Schieberle, 2005 | 30. m/0.32 mm/0.25 μm, He; Program: 40 0C (2 min) 6 K/min -> 190 0C 12 K/min -> 240 0C |
Capillary | DB-FFAP | 1859. | Buettner, 2004 | 30. m/0.32 mm/0.25 μm, He; Program: 40C(2min) => 40C/min => 60C(2min) => 6C/min => 180C => 15C/min => 230C (10min) |
Capillary | FFAP | 1870. | Didzbalis, Ritter, et al., 2004 | 30. m/0.32 mm/0.25 μm, He; Program: 35C(1min) => 60C/min => 60C => 6C/min => 230C |
Capillary | DB-Wax | 1880. | Escudero, Gogorza, et al., 2004 | Program: not specified |
Capillary | Carbowax 20M | 1840. | Vinogradov, 2004 | Program: not specified |
Capillary | CP-WAX 57CB | 1890. | Martí, Mestres, et al., 2003 | 50. m/0.25 mm/0.2 μm, He; Program: 40C(10min) => 5C/min => 100C => 3C/min => 180C => 20C/min => 210C (10min) |
Capillary | TRWAX | 1899. | Torrens, 2002 | 60. m/0.25 mm/0.25 μm, He; Program: not specified |
Capillary | DB-FFAP | 1850. | Mayer and Grosch, 2001 | 30. m/0.32 mm/0.25 μm, He; Program: 35 0C (2 min) 40 K/min -> 60 0C (1 min) 6 K/min -> 240 0C |
Capillary | DB-Wax | 1840. | Mayorga, Knapp, et al., 2001 | 30. m/0.25 mm/0.25 μm; Program: 50C(4min) => 4C/min => 130C => 1C/min => 190C => 4C/min => 220C(20min) |
Capillary | DB-Wax | 1853. | Mayorga, Knapp, et al., 2001 | 30. m/0.25 mm/0.25 μm; Program: 50C(4min) => 4C/min => 130C => 1C/min => 190C => 4C/min => 220C(20min) |
Capillary | Innowax FSC | 1878. | Saglam, Gozler, et al., 2001 | 60. m/0.25 mm/0.25 μm, He; Program: 60C(10min) => 4C/min => 220C(10min) => 1C/min => 240C |
Capillary | FFAP | 1831. | Matsui, Guth, et al., 1998 | 30. m/0.32 mm/0.25 μm, He; Program: 35C(1min) => 40C/min => 60C (1min) => 6C/min => 230C |
Capillary | FFAP | 1867. | Reiners and Grosch, 1998 | 25. m/0.32 mm/0.3 μm; Program: 35C (2min) => 40C/min => 60C(1min) => 6C/min => 230C |
Capillary | DB-FFAP | 1846. | Guth, 1997 | 30. m/0.32 mm/0.25 μm; Program: 35C (1min) => 40C/min => 60C (1min) => 6C/min => 250C (10min) |
Capillary | DB-FFAP | 1859. | Lizárraga-Guerra, Guth, et al., 1997 | He; Column length: 30. m; Column diameter: 0.32 mm; Program: 35C => 40C/min => 60C (1min) => 6C/min => 250C |
Capillary | Supelcowax-10 | 1850. | Schieberle and Grosch, 1994 | He; Column length: 30. m; Column diameter: 0.32 mm; Program: 35C => 40C/min => 60C(2min) => 4C/min => 240C |
Capillary | FFAP | 1850. | Blank, Sen, et al., 1992 | Program: not specified |
Capillary | DB-Wax | 1814. | Hatsuko, Kazuko, et al., 1992 | He; Column length: 30. m; Column diameter: 0.25 mm; Program: not specified |
Capillary | Stabilwax DA | 1860. | Henderson and Henderson, 1992 | 15. m/0.25 mm/0.25 μm, He; Program: not specified |
Capillary | DB-Wax | 1840. | Peng, Yang, et al., 1991 | Program: not specified |
Capillary | Carbowax 20M | 1840. | Shibamoto, 1987 | Program: not specified |

Lee's RI, non-polar column, temperature ramp

Column type | Active phase | I | Reference | Comment |
---|---|---|---|---|
Capillary | DB-5 | 180.07 | Williams and Horne, 1995 | He, 60. C @ 2. min, 5. K/min; Column length: 25. m; Column diameter: 0.3 mm; Tend: 270. C |

References

Weast and Grasselli, 1989
CRC Handbook of Data on Organic Compounds, 2nd Editon, Weast,R.C and Grasselli, J.G., ed(s)., CRC Press, Inc., Boca Raton, FL, 1989, 1. [all data]
Lecat, 1947
Lecat, M.,
Orthobaric Azeotropes of Sulfides,
Bull. Cl. Sci., Acad. R. Belg., 1947, 33, 160-82. [all data]
Lecat, 1927
Lecat, M.,
New binary azeotropes: 7th list,
Ann. Soc. Sci. Bruxelles, Ser. B, 1927, 47, 108-14. [all data]
Lecat, 1926
Lecat, M.,
New binary azeotropes: 3rd list,
Ann. Soc. Sci. Bruxelles, Ser. B, 1926, 45, 284-94. [all data]
Clever and Muthmann, 1896
Clever; Muthmann,
Chem. Ber., 1896, 29, 340. [all data]
Lindberg and Stenholm, 1966
Lindberg, J.J.; Stenholm, V.,
Viscosities, Densities, and Related Properties of Binary Mixtures Containing Dimethyl Sulphoxide and Mono-Subst. Benzenes or Guaiacol,
Suom. Kemistiseuran Tied., 1966, 75, 22. [all data]
Philip and Smith, 1905
Philip, J.C.; Smith, S.H.,
Researches on the freezing points of binary mixtures of organic substances: the behavior of the dihydric phenols towards p-toluidine,alpha-naphthylamine, and picric acid,
J. Chem. Soc., 1905, 87, 1735. [all data]
Matos, Miranda, et al., 2003
Matos, M. Agostinha R.; Miranda, Margarida S.; Morais, Victor M.F.,
Thermochemical Study of the Methoxy- and Dimethoxyphenol Isomers,
J. Chem. Eng. Data, 2003, 48, 3, 669-679, https://doi.org/10.1021/je025641j
. [all data]
Stephenson and Malanowski, 1987
Stephenson, Richard M.; Malanowski, Stanislaw,
Handbook of the Thermodynamics of Organic Compounds, 1987, https://doi.org/10.1007/978-94-009-3173-2
. [all data]
Kkykj and Repas, 1973
Kkykj, J.; Repas, M.,
Petrochemia, 1973, 13, 179. [all data]
von Terres, Gebert, et al., 1955
von Terres, E.; Gebert, F.; Hulsemann, H.; Petereit, H.; Toepsch, H.; Ruppert, W.,
Brennst.-Chem., 1955, 36, 272. [all data]
von Terres, Gebert, et al., 1955, 2
von Terres, E.; Gebert, F.; Hulsemann, H.; Petereit, H.; Toepsch, H.; Ruppert, W.,
Zur Kenntnis der physikalisch-chemischen Grundlagen der Gewinnung und Zerlegung der Phenolfraktionen von Steinkohlenteer und Braunkohlenschwelteer. IV. Mitteilung Die Dampfdrucke von Phenol und Phenolderivaten,
Brennst.-Chem., 1955, 36, 272-274. [all data]
Stull, 1947
Stull, Daniel R.,
Vapor Pressure of Pure Substances. Organic and Inorganic Compounds,
Ind. Eng. Chem., 1947, 39, 4, 517-540, https://doi.org/10.1021/ie50448a022
. [all data]