Benzenamine, 2-methoxy-
- Formula: C7H9NO
- Molecular weight: 123.1525
- IUPAC Standard InChIKey: VMPITZXILSNTON-UHFFFAOYSA-N
- CAS Registry Number: 90-04-0
- Chemical structure:
View 3d structure (requires JavaScript / HTML 5) - Other names: o-Anisidine; o-Aminoanisole; o-Methoxyaniline; 1-Amino-2-methoxybenzene; 2-Aminoanisole; 2-Methoxy-1-aminobenzene; 2-Methoxyaniline; 2-Methoxybenzenamine; 2-Anisidine; o-Methoxyphenylamine; o-Anisylamine; 2-Methoxy-phenylamine; o-Aminophenol methyl ether; Ortho-anisidine; 2-Aminomethoxybenzene; NSC 3122

Condensed phase thermochemistry data

Data compiled by: Hussein Y. Afeefy, Joel F. Liebman, and Stephen E. Stein
Quantity | Value | Units | Method | Reference | Comment |
---|---|---|---|---|---|
ΔfH°solid | -46. | kJ/mol | Ccb | Contineanu, Ionescu, et al., 1992 | |
Quantity | Value | Units | Method | Reference | Comment |
ΔcH°solid | -3994.8 ± 1.3 | kJ/mol | Ccb | Contineanu, Ionescu, et al., 1992 |

Phase change data

Data compiled as indicated in comments:
BS - Robert L. Brown and Stephen E. Stein
TRC - Thermodynamics Research Center, NIST Boulder Laboratories, Chris Muzny director
AC - William E. Acree, Jr., James S. Chickos
Quantity | Value | Units | Method | Reference | Comment |
---|---|---|---|---|---|
Tboil | 497.2 | K | N/A | Weast and Grasselli, 1989 | BS |
Tboil | 498.15 | K | N/A | Perkin, 1896 | Uncertainty assigned by TRC = 1.5 K; TRC |
Enthalpy of vaporization
ΔvapH (kJ/mol) | Temperature (K) | Method | Reference | Comment |
---|---|---|---|---|
57.5 | 349. | A | Stephenson and Malanowski, 1987 | Based on data from 334. to 492. K. See also Stull, 1947.; AC |
Antoine Equation Parameters
log10(P) = A − (B / (T + C))
P = vapor pressure (bar)
T = temperature (K)
View plot Requires a JavaScript / HTML 5 canvas capable browser.
Temperature (K) | A | B | C | Reference | Comment |
---|---|---|---|---|---|
334. to 491.7 | 5.43289 | 2475.78 | -36.016 | Stull, 1947 | Coefficents calculated by NIST from author's data. |

Gas phase ion energetics data

Data evaluated as indicated in comments:
HL - Edward P. Hunter and Sharon G. Lias
Data compiled as indicated in comments:
RDSH - Henry M. Rosenstock, Keith Draxl, Bruce W. Steiner, and John T. Herron
Quantity | Value | Units | Method | Reference | Comment |
---|---|---|---|---|---|
Proton affinity (review) | 216.3 | kcal/mol | N/A | Hunter and Lias, 1998 | HL |
Quantity | Value | Units | Method | Reference | Comment |
Gas basicity | 208.7 | kcal/mol | N/A | Hunter and Lias, 1998 | HL |
Ionization energy determinations
IE (eV) | Method | Reference | Comment |
---|---|---|---|
7.5 ± 0.1 | CTS | Farrell and Newton, 1966 | RDSH |

References

Contineanu, Ionescu, et al., 1992
Contineanu, I.; Ionescu, T.; Marchidan, D.I.,
The enthalpies of combustion and formation of o-anisidine, o-acetanisidine, 4-nitro-o-anisidine and 5-nitro-o-anisidine,
Rev. Roum. Chim., 1992, 37, 1111-1116. [all data]
Weast and Grasselli, 1989
CRC Handbook of Data on Organic Compounds, 2nd Editon, Weast,R.C and Grasselli, J.G., ed(s)., CRC Press, Inc., Boca Raton, FL, 1989, 1. [all data]
Perkin, 1896
Perkin, W.H.,
LXIX. On Magnetic Rotatory Power, especially of Aromatic Compounds,
J. Chem. Soc., 1896, 69, 1025-1257. [all data]
Stephenson and Malanowski, 1987
Stephenson, Richard M.; Malanowski, Stanislaw,
Handbook of the Thermodynamics of Organic Compounds, 1987, https://doi.org/10.1007/978-94-009-3173-2
. [all data]
Stull, 1947
Stull, Daniel R.,
Vapor Pressure of Pure Substances. Organic and Inorganic Compounds,
Ind. Eng. Chem., 1947, 39, 4, 517-540, https://doi.org/10.1021/ie50448a022
. [all data]