Ethene, 1-chloro-1,2,2-trifluoro-, homopolymer

Phase change data

Data compiled by: Eugene S. Domalski and Elizabeth D. Hearing

Enthalpy of fusion

ΔfusH (kJ/mol) Temperature (K) Reference Comment
4.659497.Chang and Weeks, 1992

Entropy of fusion

ΔfusS (J/mol*K) Temperature (K) Reference Comment
9.3497.Chang and Weeks, 1992

References

Chang and Weeks, 1992
Chang, S.-S.; Weeks, J.J., Heat capacity and thermodynamic properties of poly(chlorotrifluoroethylene) from 2.5 to 620 K, J. Res. Natl. Inst. Stand. Technol., 1992, 97(3), 341-363. [all data]