Phenol, 2-ethyl-
- Formula: C8H10O
- Molecular weight: 122.1644
- IUPAC Standard InChIKey: IXQGCWUGDFDQMF-UHFFFAOYSA-N
- CAS Registry Number: 90-00-6
- Chemical structure:
View 3d structure (requires JavaScript / HTML 5) - Other names: Phenol, o-ethyl-; o-Ethylphenol; Phlorol; 1-Ethyl-2-hydroxybenzene; 2-Ethylphenol; 1-Hydroxy-2-ethylbenzene; Florol; o-Hydroxyethylbenzene; NSC 10112; Ethylphenol

Gas phase thermochemistry data

Data compiled by: Hussein Y. Afeefy, Joel F. Liebman, and Stephen E. Stein
Quantity | Value | Units | Method | Reference | Comment |
---|---|---|---|---|---|
ΔfH°gas | -145.2 | kJ/mol | Ccb | Bertholon, Giray, et al., 1971 |

Condensed phase thermochemistry data

Data compiled by: Hussein Y. Afeefy, Joel F. Liebman, and Stephen E. Stein
Quantity | Value | Units | Method | Reference | Comment |
---|---|---|---|---|---|
ΔfH°liquid | -208.8 | kJ/mol | Ccb | Bertholon, Giray, et al., 1971 | |
Quantity | Value | Units | Method | Reference | Comment |
ΔcH°liquid | -4368.39 | kJ/mol | Ccb | Bertholon, Giray, et al., 1971 | Corresponding ΔfHºliquid = -208.8 kJ/mol (simple calculation by NIST; no Washburn corrections) |

Phase change data

Data compiled as indicated in comments:
BS - Robert L. Brown and Stephen E. Stein
TRC - Thermodynamics Research Center, NIST Boulder Laboratories, Chris Muzny director
AC - William E. Acree, Jr., James S. Chickos
ALS - Hussein Y. Afeefy, Joel F. Liebman, and Stephen E. Stein
DRB - Donald R. Burgess, Jr.
Quantity | Value | Units | Method | Reference | Comment |
---|---|---|---|---|---|
Tboil | 478. ± 7. | K | AVG | N/A | Average of 14 values; Individual data points |
Quantity | Value | Units | Method | Reference | Comment |
Tfus | 280. ± 100. | K | AVG | N/A | Average of 6 values; Individual data points |
Quantity | Value | Units | Method | Reference | Comment |
Tc | 702.95 | K | N/A | Ambrose, 1963 | Uncertainty assigned by TRC = 0.3 K; TRC |
Quantity | Value | Units | Method | Reference | Comment |
ΔvapH° | 64.5 | kJ/mol | CGC | Chickos, Hosseini, et al., 1995 | Based on data from 393. to 433. K.; AC |
ΔvapH° | 63.60 | kJ/mol | C | Bertholon, Giray, et al., 1971 | ALS |
ΔvapH° | 63.6 | kJ/mol | N/A | Bertholon, Giray, et al., 1971 | DRB |
Enthalpy of vaporization
ΔvapH (kJ/mol) | Temperature (K) | Method | Reference | Comment |
---|---|---|---|---|
50.5 | 438. | A,GS,EB | Stephenson and Malanowski, 1987 | Based on data from 423. to 491. K. See also Biddiscombe, Handley, et al., 1963.; AC |
63.5 | 292. | A,GS,EB | Stephenson and Malanowski, 1987 | Based on data from 277. to 318. K. See also Biddiscombe, Handley, et al., 1963.; AC |
51.6 | 374. | N/A | von Terres, Gebert, et al., 1955 | Based on data from 359. to 480. K.; AC |
51.4 | 348. | N/A | Stage, Müller, et al., 1953 | Based on data from 321. to 492. K.; AC |
49.5 | 373. | N/A | Stage, Müller, et al., 1953 | Based on data from 321. to 492. K.; AC |
48.6 | 398. | N/A | Stage, Müller, et al., 1953 | Based on data from 321. to 492. K.; AC |
47.0 | 423. | N/A | Stage, Müller, et al., 1953 | Based on data from 321. to 492. K.; AC |
43.1 | 473. | N/A | Stage, Müller, et al., 1953 | Based on data from 321. to 492. K.; AC |
Antoine Equation Parameters
log10(P) = A − (B / (T + C))
P = vapor pressure (bar)
T = temperature (K)
View plot Requires a JavaScript / HTML 5 canvas capable browser.
Temperature (K) | A | B | C | Reference | Comment |
---|---|---|---|---|---|
423.57 to 491.19 | 4.13274 | 1549.245 | -102.272 | Biddiscombe, Handley, et al., 1963, 2 | Coefficents calculated by NIST from author's data. |
359. to 480.7 | 5.32312 | 2469.434 | -16.292 | von Terres, Gebert, et al., 1955, 2 | Coefficents calculated by NIST from author's data. |
Enthalpy of sublimation
ΔsubH (kJ/mol) | Temperature (K) | Method | Reference | Comment |
---|---|---|---|---|
80.3 ± 0.5 | 278. to 317. | GS | Biddiscombe, Handley, et al., 1963 | See also Cox and Pilcher, 1970 and Stephenson and Malanowski, 1987.; AC |

Lee's RI, non-polar column, temperature ramp

Data compiled by: NIST Mass Spectrometry Data Center, William E. Wallace, director

Column type CapillaryCapillaryCapillaryCapillary
Active phase HP-5DB-5DB-5DB-5
Column length (m) 30.25.30.30.
Carrier gas HeHeHeHe
Substrate
Column diameter (mm) 0.30.30.320.26
Phase thickness (μm) 0.25 0.250.25
Tstart (C) 50.60.40.50.
Tend (C) 200.270.285.300.
Heat rate (K/min) 5.5.8.6.
Initial hold (min) 5.2.3.4.
Final hold (min) 15. 29.520.
I 190.189.73188.3190.21
ReferenceShao, Wang, et al., 2006Williams and Horne, 1995Donnelly, Abdel-Hamid, et al., 1993Rostad and Pereira, 1986
Comment MSDC-RI MSDC-RI MSDC-RI MSDC-RI

References

Bertholon, Giray, et al., 1971
Bertholon, G.; Giray, M.; Perrin, R.; Vincent-Falquet-Berny, M.F.,
No. 532. - Etude physicochimique des phenols. OX. - Ethanlpies de combustion et energies de resonance des alcoyl et aryphenols,
Bull. Soc. Chim. France, 1971, 3180-3187. [all data]
Ambrose, 1963
Ambrose, D.,
Critical Temperatures of Some Phenols and Other Organic Compounds,
Trans. Faraday Soc., 1963, 59, 1988. [all data]
Chickos, Hosseini, et al., 1995
Chickos, James S.; Hosseini, Sarah; Hesse, Donald G.,
Determination of vaporization enthalpies of simple organic molecules by correlations of changes in gas chromatographic net retention times,
Thermochimica Acta, 1995, 249, 41-62, https://doi.org/10.1016/0040-6031(95)90670-3
. [all data]
Stephenson and Malanowski, 1987
Stephenson, Richard M.; Malanowski, Stanislaw,
Handbook of the Thermodynamics of Organic Compounds, 1987, https://doi.org/10.1007/978-94-009-3173-2
. [all data]
Biddiscombe, Handley, et al., 1963
Biddiscombe, D.P.; Handley, R.; Harrop, D.; Head, A.J.; Lewis, G.B.; Martin, J.F.; Sprake, C.H.S.,
1099. Thermodynamic properties of organic oxygen compounds. Part XIII. Preparation and physical properties of pure ethylphenols,
J. Chem. Soc., 1963, 5764, https://doi.org/10.1039/jr9630005764
. [all data]
von Terres, Gebert, et al., 1955
von Terres, E.; Gebert, F.; Hulsemann, H.; Petereit, H.; Toepsch, H.; Ruppert, W.,
Brennst.-Chem., 1955, 36, 272. [all data]
Stage, Müller, et al., 1953
Stage, H.; Müller, E.; Faldix, P.,
Erdol u Kohle, 1953, 6, 375. [all data]
Biddiscombe, Handley, et al., 1963, 2
Biddiscombe, D.P.; Handley, R.; Harrop, D.; Head, A.J.; Lewis, G.B.; Martin, J.F.; Sprake, C.H.S.,
Thermodynamic properties of organic oxygen compounds. Part XIII. Preparation and physical properties of pure ethylphenols,
J. Chem. Soc., 1963, 5764-5768. [all data]
von Terres, Gebert, et al., 1955, 2
von Terres, E.; Gebert, F.; Hulsemann, H.; Petereit, H.; Toepsch, H.; Ruppert, W.,
Zur Kenntnis der physikalisch-chemischen Grundlagen der Gewinnung und Zerlegung der Phenolfraktionen von Steinkohlenteer und Braunkohlenschwelteer. IV. Mitteilung Die Dampfdrucke von Phenol und Phenolderivaten,
Brennst.-Chem., 1955, 36, 272-274. [all data]
Cox and Pilcher, 1970
Cox, J.D.; Pilcher, G.,
Thermochemistry of Organic and Organometallic Compounds, Academic Press Inc., London, 1970, 643. [all data]