Benzaldehyde, 2-chloro-
- Formula: C7H5ClO
- Molecular weight: 140.567
- IUPAC Standard InChIKey: FPYUJUBAXZAQNL-UHFFFAOYSA-N
- CAS Registry Number: 89-98-5
- Chemical structure:
View 3d structure (requires JavaScript / HTML 5) - Other names: Benzaldehyde, o-chloro-; o-Chlorobenzaldehyde; 2-Chlorobenzaldehyde; o-Chloorbenzaldehyde; USAF M-7; 2-Chlorbenzaldehyd; 2-Clorobenzaldeide; o-Chlorobenzenecarboxaldehyde; o-Chloroformylbenzene; NSC 15347

Phase change data

Data compiled as indicated in comments:
BS - Robert L. Brown and Stephen E. Stein
TRC - Thermodynamics Research Center, NIST Boulder Laboratories, Chris Muzny director
AC - William E. Acree, Jr., James S. Chickos
Quantity | Value | Units | Method | Reference | Comment |
---|---|---|---|---|---|
Tboil | 485.1 | K | N/A | Weast and Grasselli, 1989 | BS |
Tboil | 485.19 | K | N/A | Dreisbach and Martin, 1949 | Uncertainty assigned by TRC = 0.07 K; TRC |
Quantity | Value | Units | Method | Reference | Comment |
Tfus | 285.3 | K | N/A | Dreisbach, 1955 | Uncertainty assigned by TRC = 0.02 K; TRC |
Tfus | 284.8 | K | N/A | Dreisbach and Martin, 1949 | Uncertainty assigned by TRC = 0.05 K; TRC |
Enthalpy of vaporization
ΔvapH (kJ/mol) | Temperature (K) | Method | Reference | Comment |
---|---|---|---|---|
49.8 | 397. | A | Stephenson and Malanowski, 1987 | Based on data from 382. to 563. K. See also Dykyj, Svoboda, et al., 1999.; AC |

Condensed phase thermochemistry data

Data compiled by: Hussein Y. Afeefy, Joel F. Liebman, and Stephen E. Stein
Quantity | Value | Units | Method | Reference | Comment |
---|---|---|---|---|---|
ΔfH°liquid | -98. | kJ/mol | Ccb | Zavoianu, Contineanu, et al., 1987 | |
Quantity | Value | Units | Method | Reference | Comment |
ΔcH°liquid | -3372. | kJ/mol | Ccb | Zavoianu, Contineanu, et al., 1987 | |
ΔcH°liquid | -3374.4 ± 8.4 | kJ/mol | Ccb | Smith, Bjellerup, et al., 1953 | Reanalyzed by Cox and Pilcher, 1970, Original value = -3371. ± 4. kJ/mol |

Normal alkane RI, non-polar column, custom temperature program

Data compiled by: NIST Mass Spectrometry Data Center, William E. Wallace, director

Column type Capillary
Active phase OV-101
Column length (m)
Carrier gas
Substrate
Column diameter (mm)
Phase thickness (μm)
Program not specified
I 1105.
ReferenceEbrahimi and Hadjmohammadi, 2006
Comment MSDC-RI

References

Weast and Grasselli, 1989
CRC Handbook of Data on Organic Compounds, 2nd Editon, Weast,R.C and Grasselli, J.G., ed(s)., CRC Press, Inc., Boca Raton, FL, 1989, 1. [all data]
Dreisbach and Martin, 1949
Dreisbach, R.R.; Martin, R.A.,
Physical Data on Some Organic Compounds,
Ind. Eng. Chem., 1949, 41, 2875-8. [all data]
Dreisbach, 1955
Dreisbach, R.R.,
Physical Properties of Chemical Compounds, Advances in Chemistry Series No. 15, Am. Chem. Soc.: Washington, D. C., 1955. [all data]
Stephenson and Malanowski, 1987
Stephenson, Richard M.; Malanowski, Stanislaw,
Handbook of the Thermodynamics of Organic Compounds, 1987, https://doi.org/10.1007/978-94-009-3173-2
. [all data]
Dykyj, Svoboda, et al., 1999
Dykyj, J.; Svoboda, J.; Wilhoit, R.C.; Frenkel, M.L.; Hall, K.R.,
Vapor Pressure of Chemicals: Part A. Vapor Pressure and Antoine Constants for Hydrocarbons and Sulfur, Selenium, Tellurium and Hydrogen Containing Organic Compounds, Springer, Berlin, 1999, 373. [all data]