6-methylcyclohex-3-enecarbaldehyde
- Formula: C8H12O
- Molecular weight: 124.1803
- IUPAC Standard InChIKey: BOPCAWBPVSVBMM-UHFFFAOYSA-N
- CAS Registry Number: 89-94-1
- Chemical structure:
View 3d structure (requires JavaScript / HTML 5) - Other names: 6-methyl-3-cyclohexene-1-carboxaldehyde

Phase change data

Data compiled by: Thermodynamics Research Center, NIST Boulder Laboratories, Chris Muzny director
Quantity | Value | Units | Method | Reference | Comment |
---|---|---|---|---|---|
Tboil | 391.0 | K | N/A | Shortridge, Craig, et al., 1948 | Uncertainty assigned by TRC = 1.5 K |
Quantity | Value | Units | Method | Reference | Comment |
Tfus | 234.2 | K | N/A | Anonymous, 1954 | Uncertainty assigned by TRC = 0.7 K |

References

Shortridge, Craig, et al., 1948
Shortridge, R.W.; Craig, R.A.; Greenlee, K.W.; Derfer, J.M.; Boord, C.E.,
The Synthesis of Some Cyclopropane and Spirane Hydrocarbons,
J. Am. Chem. Soc., 1948, 70, 946. [all data]
Anonymous, 1954
Anonymous, R.,
, Am. Pet. Inst. Res. Proj. 45, Tech. Rep. 13, Ohio State Univ., 1954. [all data]