β-Resorcylic acid
- Formula: C7H6O4
- Molecular weight: 154.1201
- IUPAC Standard InChIKey: UIAFKZKHHVMJGS-UHFFFAOYSA-N
- CAS Registry Number: 89-86-1
- Chemical structure:

Phase change data

Data compiled as indicated in comments:
TRC - Thermodynamics Research Center, NIST Boulder Laboratories, Chris Muzny director
AC - William E. Acree, Jr., James S. Chickos
Quantity | Value | Units | Method | Reference | Comment |
---|---|---|---|---|---|
Tfus | 492. | K | N/A | King, McWhirter, et al., 1945 | Uncertainty assigned by TRC = 4. K; TRC |
Quantity | Value | Units | Method | Reference | Comment |
ΔsubH° | 30.2 ± 0.2 | kcal/mol | ME | Monte, Gonc«807»alves, et al., 2010 | Based on data from 376. to 392. K.; AC |
Enthalpy of sublimation
ΔsubH (kcal/mol) | Temperature (K) | Method | Reference | Comment |
---|---|---|---|---|
29.6 ± 0.2 | 384. | ME | Monte, Gonc«807»alves, et al., 2010 | Based on data from 376. to 392. K.; AC |

Normal alkane RI, non-polar column, isothermal

Column type | Active phase | Temperature (C) | I | Reference | Comment |
---|---|---|---|---|---|
Packed | Apieson L | 140. | 1532. | Hedin, Minyard, et al., 1967 | Nitrogen, Chromosorb W HMDS (60-80 mesh); Column length: 1.8 m |

References

King, McWhirter, et al., 1945
King, L.C.; McWhirter, M.; Barton, D.M.,
Reactions of Acetophenols with Iodine and Pyridine and the Preparation of Hydroxybenzoic Acids,
J. Am. Chem. Soc., 1945, 67, 2089-92. [all data]
Monte, Gonc«807»alves, et al., 2010
Monte, Manuel J.S.; Gonc«807»alves, Mariana V.; Ribeiro da Silva, Maria D.M.C.,
Vapor Pressures and Enthalpies of Combustion of the Dihydroxybenzoic Acid Isomers,
J. Chem. Eng. Data, 2010, 55, 6, 2246-2251, https://doi.org/10.1021/je900777q
. [all data]
Hedin, Minyard, et al., 1967
Hedin, P.A.; Minyard, J.P.; Thompson, A.C.,
Chromatographic and spectral analysis of phenolic acids and related compounds,
J. Chromatogr., 1967, 30, 43-53, https://doi.org/10.1016/S0021-9673(00)84111-4
. [all data]