Ethanone, 1-(2,4-dihydroxyphenyl)-
- Formula: C8H8O3
- Molecular weight: 152.1473
- IUPAC Standard InChIKey: SULYEHHGGXARJS-UHFFFAOYSA-N
- CAS Registry Number: 89-84-9
- Chemical structure:
View 3d structure (requires JavaScript / HTML 5) - Other names: Acetophenone, 2',4'-dihydroxy-; β-Resacetophenone; Resacetophenone; Resoacetophenone; 2,4-Dihydroxyacetophenone; 2',4'-Dihydroxyacetophenone; 4-Acetylresorcinol; Resorcinol, 4-acetyl-; beta-Resacetophenone; 1-(2,4-Dihydroxyphenyl)ethanone; 1-Acetylbenzene-2,4-diol; 4-Acetyl-1,3-benzenediol; NSC 10883

Condensed phase thermochemistry data

Data compiled by: Hussein Y. Afeefy, Joel F. Liebman, and Stephen E. Stein
Quantity | Value | Units | Method | Reference | Comment |
---|---|---|---|---|---|
ΔcH°solid | -888.60 ± 0.90 | kcal/mol | Ccb | Bonino, Manzoni-Ansidei, et al., 1937 | Reanalyzed by Cox and Pilcher, 1970, Original value = -889.6 kcal/mol; Corresponding ΔfHºsolid = -137.07 kcal/mol (simple calculation by NIST; no Washburn corrections) |

References

Bonino, Manzoni-Ansidei, et al., 1937
Bonino, G.B.; Manzoni-Ansidei, R.; Rolla, M.,
Contributi sperimentali al probema della chelazione. VI. Ricerche termochimiche su acetilfenoli e acetil-resorcine,
Ricerca Sci., 1937, 8, 357-360. [all data]
Cox and Pilcher, 1970
Cox, J.D.; Pilcher, G.,
Thermochemistry of Organic and Organometallic Compounds, Academic Press, New York, 1970, 1-636. [all data]