Thymol
- Formula: C10H14O
- Molecular weight: 150.2176
- IUPAC Standard InChIKey: MGSRCZKZVOBKFT-UHFFFAOYSA-N
- CAS Registry Number: 89-83-8
- Chemical structure:
View 3d structure (requires JavaScript / HTML 5) - Other names: Phenol, 5-methyl-2-(1-methylethyl)-; p-Cymen-3-ol; Thyme camphor; 2-Isopropyl-5-methylphenol; 3-Hydroxy-p-cymene; 3-Methyl-6-isopropylphenol; 5-Methyl-2-isopropylphenol; 6-Isopropyl-m-cresol; 6-Isopropyl-3-methylphenol; m-Cresol, 6-isopropyl-; p-Cymene, 3-hydroxy-; Phenol, 2-isopropyl-5-methyl-; Thymic acid; 1-Hydroxy-5-methyl-2-isopropylbenzene; 1-Methyl-3-hydroxy-4-isopropylbenzene; 3-p-Cymenol; 3-Hydroxy-1-methyl-4-isopropylbenzene; 5-Methyl-2-isopropyl-1-phenol; 5-Methyl-2-(1-methylethyl)phenol; Isopropyl-m-cresol; m-Thymol; 2-Hydroxy-1-isopropyl-4-methylbenzene; NSC 11215; 2-Isopropyl-5-methylphenol (thymol); Isopropyl cresol

Gas phase thermochemistry data

Data compiled by: Hussein Y. Afeefy, Joel F. Liebman, and Stephen E. Stein
Quantity | Value | Units | Method | Reference | Comment |
---|---|---|---|---|---|
ΔfH°gas | -184.6 | kJ/mol | Ccb | Bertholon, Giray, et al., 1971 |

Condensed phase thermochemistry data

Data compiled by: Hussein Y. Afeefy, Joel F. Liebman, and Stephen E. Stein
Quantity | Value | Units | Method | Reference | Comment |
---|---|---|---|---|---|
ΔfH°solid | -280. | kJ/mol | Ccb | Bertholon, Giray, et al., 1971 | |
Quantity | Value | Units | Method | Reference | Comment |
ΔcH°solid | -5657. | kJ/mol | Ccb | Bertholon, Giray, et al., 1971 | Corresponding ΔfHºsolid = -280. kJ/mol (simple calculation by NIST; no Washburn corrections) |
ΔcH°solid | -5626.2 ± 9.6 | kJ/mol | Ccb | Fischer, Cotton, et al., 1959 | ΔE = -1342.9±2.3 kcal/mol; Corresponding ΔfHºsolid = -310. kJ/mol (simple calculation by NIST; no Washburn corrections) |

Phase change data

Data compiled as indicated in comments:
BS - Robert L. Brown and Stephen E. Stein
TRC - Thermodynamics Research Center, NIST Boulder Laboratories, Chris Muzny director
AC - William E. Acree, Jr., James S. Chickos
ALS - Hussein Y. Afeefy, Joel F. Liebman, and Stephen E. Stein
DRB - Donald R. Burgess, Jr.
Quantity | Value | Units | Method | Reference | Comment |
---|---|---|---|---|---|
Tboil | 506. ± 1. | K | AVG | N/A | Average of 9 values; Individual data points |
Quantity | Value | Units | Method | Reference | Comment |
Tfus | 323. ± 2. | K | AVG | N/A | Average of 12 values; Individual data points |
Quantity | Value | Units | Method | Reference | Comment |
Tc | 698.3 | K | N/A | Radice, 1899 | Uncertainty assigned by TRC = 4. K; TRC |
Quantity | Value | Units | Method | Reference | Comment |
ΔvapH° | 70.9 | kJ/mol | GC | Hoskovec, Grygarová, et al., 2005 | Based on data from 333. to 433. K.; AC |
ΔvapH° | 68.7 | kJ/mol | GC | van Roon, Parsons, et al., 2002 | AC |
ΔvapH° | 70.5 | kJ/mol | CGC | Chickos, Hosseini, et al., 1995 | Based on data from 393. to 433. K.; AC |
Quantity | Value | Units | Method | Reference | Comment |
ΔsubH° | 95.73 | kJ/mol | C | Bertholon, Giray, et al., 1971 | ALS |
ΔsubH° | 95.4 | kJ/mol | N/A | Bertholon, Giray, et al., 1971 | DRB |
ΔsubH° | 91.5 | kJ/mol | N/A | Sherwood and Bryant, 1957 | Based on data from 283. to 323. K. See also Stephenson and Malanowski, 1987.; AC |
Enthalpy of vaporization
ΔvapH (kJ/mol) | Temperature (K) | Method | Reference | Comment |
---|---|---|---|---|
58.4 | 396. | A | Stephenson and Malanowski, 1987 | Based on data from 381. to 514. K.; AC |
63.2 | 373. | N/A | Stage, Müller, et al., 1953 | Based on data from 339. to 514. K.; AC |
58.4 | 398. | N/A | Stage, Müller, et al., 1953 | Based on data from 339. to 514. K.; AC |
55.2 | 423. | N/A | Stage, Müller, et al., 1953 | Based on data from 339. to 514. K.; AC |
52.8 | 448. | N/A | Stage, Müller, et al., 1953 | Based on data from 339. to 514. K.; AC |
51.5 | 473. | N/A | Stage, Müller, et al., 1953 | Based on data from 339. to 514. K.; AC |
54.9 | 352. | N/A | Stull, 1947 | Based on data from 337. to 505. K.; AC |
Antoine Equation Parameters
log10(P) = A − (B / (T + C))
P = vapor pressure (bar)
T = temperature (K)
View plot Requires a JavaScript / HTML 5 canvas capable browser.
Temperature (K) | A | B | C | Reference | Comment |
---|---|---|---|---|---|
337.5 to 505.0 | 5.29395 | 2522.332 | -28.575 | Stull, 1947 | Coefficents calculated by NIST from author's data. |
Enthalpy of sublimation
ΔsubH (kJ/mol) | Temperature (K) | Method | Reference | Comment |
---|---|---|---|---|
75.1 | 284. | A | Stephenson and Malanowski, 1987 | Based on data from 273. to 295. K. See also Aihara, 1960.; AC |
89.1 ± 4.5 | 303. | HSA | Chickos, 1975 | Based on data from 293. to 323. K.; AC |
91.2 ± 4.1 | 273. to 313. | TE | Cox and Pilcher, 1970 | See also Jones, 1960 and Balson, 1947.; AC |
Enthalpy of fusion
ΔfusH (kJ/mol) | Temperature (K) | Reference | Comment |
---|---|---|---|
22.01 | 324.2 | Chickos, Braton, et al., 1991 | AC |

Normal alkane RI, polar column, temperature ramp

Data compiled by: NIST Mass Spectrometry Data Center, William E. Wallace, director

Column type CapillaryCapillaryCapillaryCapillaryCapillary
Active phase RTX-WaxTC-WaxSupelcowaxTC-WAXRTX-Wax
Column length (m) 60.60.60.60.60.
Carrier gas HeliumHeliumNitrogenHeliumHelium
Substrate
Column diameter (mm) 0.220.250.350.250.22
Phase thickness (μm) 0.25 0.25 0.25
Tstart (C) 60.40.60.40.60.
Tend (C) 230.230.230.230.230.
Heat rate (K/min) 2.3.4.3.2.
Initial hold (min)  3. 3.
Final hold (min) 5. 40. 30.
I 2149.2191.2187.2177.2145.
ReferenceBendiabdellah, El Amine Dib, et al., 2012Miyazawa, Fujita, et al., 2010Gauvin-Bialecki and Marodon, 2009Miyazawa, Tomita, et al., 2009Museli, Pau, et al., 2009
Comment MSDC-RI MSDC-RI MSDC-RI MSDC-RI MSDC-RI
Column type CapillaryCapillaryCapillaryCapillaryCapillary
Active phase InnowaxHP-InnowaxHP-InnowaxCP Wax 52 CBCarbowax
Column length (m) 30.50.30.60.60.
Carrier gas HeliumHeliumN2HeliumHe
Substrate
Column diameter (mm) 0.250.200.250.250.2
Phase thickness (μm) 0.250.200.250.250.25
Tstart (C) 40.45.50.40.60.
Tend (C) 250.190.240.220.250.
Heat rate (K/min) 6.4.5.3.2.
Initial hold (min) 1.2.1. 8.
Final hold (min) 4.50.4. 15.
I 2207.2171.2180.2162.2167.
ReferenceSeo, Kim, et al., 2009Soria, Sanz, et al., 2008Cheraif, Ben Jannet, et al., 2007Chen, Chyau, et al., 2007Ferhat, Tigrine-Kordjani, et al., 2007
Comment MSDC-RI MSDC-RI MSDC-RI MSDC-RI MSDC-RI
Column type CapillaryCapillaryCapillaryCapillaryCapillary
Active phase HP-InnowaxHP-InnowaxBP-20BP-20BP-20
Column length (m) 30.30.50.50.50.
Carrier gas HeliumHeHe He
Substrate
Column diameter (mm) 0.250.250.220.220.22
Phase thickness (μm) 0.250.250.250.250.25
Tstart (C) 40.60.60.60.60.
Tend (C) 250.240.220.220.220.
Heat rate (K/min) 2.2.2.2.2.
Initial hold (min) 5.
Final hold (min)  20.20.20.20.
I 2198.2174.2178.2185.2189.
ReferenceFormisano, Rigano, et al., 2007Hachicha, Skanji, et al., 2007Boti, Muselli, et al., 2006Boti, Yao, et al., 2006Fanciullino, Tomi, et al., 2006
Comment MSDC-RI MSDC-RI MSDC-RI MSDC-RI MSDC-RI
Column type CapillaryCapillaryCapillaryCapillaryCapillary
Active phase BP-20CP-Wax 52CBNB-20MInnowaxHP-Innowax
Column length (m) 50.30.30.50.30.
Carrier gas HeHeHeHeHe
Substrate
Column diameter (mm) 0.220.320.20.20.25
Phase thickness (μm) 0.250.250.250.50.17
Tstart (C) 60.60.50.60.60.
Tend (C) 220.220.250.250.210.
Heat rate (K/min) 2.3.32.2.4.
Initial hold (min)  7.  3.
Final hold (min) 20.3. 60.15.
I 2189.2202.2193.2162.2176.
ReferenceFanciullino, Tomi, et al., 2006Hymete, Rohloff, et al., 2006Orav, Raal, et al., 2006Bendimerad and Bendiab, 2005Ferretti, Maggi, et al., 2005
Comment MSDC-RI MSDC-RI MSDC-RI MSDC-RI MSDC-RI
Column type CapillaryCapillaryCapillaryCapillaryCapillary
Active phase CP-WaxTC-FFAPDB-WaxDB-WaxDB-Wax
Column length (m) 30.60.30.60.30.
Carrier gas HeHeHeN2He
Substrate
Column diameter (mm) 0.320.250.250.250.25
Phase thickness (μm) 0.250.40.250.250.25
Tstart (C) 40.60.50.70.40.
Tend (C) 180.220.180.230.250.
Heat rate (K/min) 5.3.3.2.4.
Initial hold (min) 2.  2.
Final hold (min)  30.40.20.10.
I 2175.2200.2179.2180.2178.
ReferenceKa, Choi, et al., 2005Kurose and Yatagai, 2005Lee, Umano, et al., 2005Njoroge, Koaze, et al., 2005Salehi, Sonboli, et al., 2005
Comment MSDC-RI MSDC-RI MSDC-RI MSDC-RI MSDC-RI
Column type CapillaryCapillaryCapillaryCapillaryCapillary
Active phase BP-20SW-10Supelcowax-10TC-WaxTC-Wax
Column length (m) 50.50.30.60.60.
Carrier gas  HeHeHe
Substrate
Column diameter (mm) 0.220.200.250.250.25
Phase thickness (μm) 0.250.250.25
Tstart (C) 60.50.60.80.80.
Tend (C) 220.230.240.240.240.
Heat rate (K/min) 2.2.4.3.3.
Initial hold (min)
Final hold (min) 20.
I 2188.2153.2143.2191.2166.
ReferenceBlanc, Muselli, et al., 2004Raal, Paaver, et al., 2004Cabanillas, Lopez, et al., 2003Miyazawa, Teranishi, et al., 2003Miyazawa, Yamafuji, et al., 2003
Comment MSDC-RI MSDC-RI MSDC-RI MSDC-RI MSDC-RI
Column type CapillaryCapillaryCapillaryCapillaryCapillary
Active phase DB-WaxDB-WaxDB-WaxBP-20Innowax
Column length (m) 60.30.30.50.60.
Carrier gas Helium  HeHe
Substrate
Column diameter (mm) 0.250.250.250.220.25
Phase thickness (μm)  0.250.250.250.25
Tstart (C) 70.30.30.60.60.
Tend (C) 210.250.250.230.220.
Heat rate (K/min) 2.4.4.2.4.
Initial hold (min)  1.1. 10.
Final hold (min) 60.  35.10.
I 2185.2188.2198.2189.2198.
ReferenceMookdasanit, Tamura, et al., 2003Tanaka, Yamauchi, et al., 2003Tanaka, Yamauchi, et al., 2003Lota, de Rocca Serra, et al., 2001Baser, Özek, et al., 2000
Comment MSDC-RI MSDC-RI MSDC-RI MSDC-RI MSDC-RI
Column type CapillaryCapillaryCapillaryCapillaryCapillary
Active phase InnowaxDB-WaxHP Innowax FSPInnowaxHP-Innowax
Column length (m) 60.60.60.60.60.
Carrier gas HeNitrogenHeHeHe
Substrate
Column diameter (mm) 0.250.250.250.250.25
Phase thickness (μm) 0.25 0.250.250.25
Tstart (C) 60.40.60.60.60.
Tend (C) 220.200.220.220.220.
Heat rate (K/min) 4.2.
Initial hold (min) 10.10.10.10.10.
Final hold (min) 10. 10.
I 2205.2189.2205.2205.2205.
ReferenceBaser, Özek, et al., 2000Tamura, Boonbumrung, et al., 2000Kaya, Baser, et al., 1999Kaya, Baser, et al., 1999, 2Kaya, Baser, et al., 1999, 3
Comment MSDC-RI MSDC-RI MSDC-RI MSDC-RI MSDC-RI
Column type CapillaryCapillaryCapillaryCapillaryCapillary
Active phase FFAPDB-WaxDB-WaxSupelcowaxHP-Innowax FSC
Column length (m) 25.60.60.60.60.
Carrier gas HeHeN2HeHe
Substrate
Column diameter (mm) 0.20.25 0.250.25
Phase thickness (μm)  0.250.25 0.25
Tstart (C) 70.40.60.80.60.
Tend (C) 210.200.220.240.220.
Heat rate (K/min) 3.2.5.5.4.
Initial hold (min) 10.2.  10.
Final hold (min)     10.
I 2196.2166.2190.2172.2205.
ReferenceMockute and Bernotiene, 1999Umano, Nakahara, et al., 1999Weyerstahl, Marschall, et al., 1999Näf and Velluz, 1998Tümen, Baser, et al., 1998
Comment MSDC-RI MSDC-RI MSDC-RI MSDC-RI MSDC-RI
Column type CapillaryCapillaryCapillaryCapillaryCapillary
Active phase DB-WaxHP-Innowax FSCTC-WaxDB-WaxDB-Wax
Column length (m) 60.60.60.30.30.
Carrier gas H2He He
Substrate
Column diameter (mm) 0.320.250.250.250.32
Phase thickness (μm) 0.25
Tstart (C) 60.60.80.60.70.
Tend (C) 220.240.240.240.200.
Heat rate (K/min) 3.4.3.3.4.
Initial hold (min)  10.5.10.2.
Final hold (min)  10.
I 2172.2205.2195.2148.2205.
ReferenceWerkhoff, Güntert, et al., 1998Baser, Kirimer, et al., 1997Shuichi, Masazumi, et al., 1996Hatsuko, Kazuko, et al., 1992Wyllie, Brophy, et al., 1990
Comment MSDC-RI MSDC-RI MSDC-RI MSDC-RI MSDC-RI
Column type Packed
Active phase Carbowax 20M
Column length (m) 2.
Carrier gas Hydrogen
Substrate Gas-Chrom Z (80-100 mesh)
Column diameter (mm)
Phase thickness (μm)
Tstart (C) 65.
Tend (C) 220.
Heat rate (K/min) 4.
Initial hold (min)
Final hold (min)
I 2153.
ReferenceStancher and Pertoldi, 1967
Comment MSDC-RI

Kovats' RI, non-polar column, temperature ramp

Data compiled by: NIST Mass Spectrometry Data Center, William E. Wallace, director

Column type CapillaryCapillaryCapillaryCapillaryCapillary
Active phase DB-5MSHP-5MSBP-1DB-5DB-5
Column length (m) 30.30.30.30.30.
Carrier gas HeHeN2HeHelium
Substrate
Column diameter (mm) 0.250.250.320.260.25
Phase thickness (μm) 0.250.250.250.250.25
Tstart (C) 60.60.60.60.60.
Tend (C) 180.280.220.246.255.
Heat rate (K/min) 3.2.5.3.3.
Initial hold (min)  8.
Final hold (min) 15.30.3.
I 1292.1297.1275.1290.1292.
ReferenceAngioni, Barra, et al., 2006Hazzit, Baaliouamer, et al., 2006Srivastava, Srivastava, et al., 2006Adams and Nguyen, 2005Medina, Lucero, et al., 2005
Comment MSDC-RI MSDC-RI MSDC-RI MSDC-RI MSDC-RI
Column type CapillaryCapillaryCapillaryCapillaryCapillary
Active phase DB-5MSBPX-5SPB-5HP-5MSHP-5
Column length (m) 30.25.60.30.30.
Carrier gas HeHeHeHeHe
Substrate
Column diameter (mm) 0.250.220.320.250.25
Phase thickness (μm) 0.250.251.0.251.
Tstart (C) 60.60.60.50.40.
Tend (C) 180.240.200.280.250.
Heat rate (K/min) 3.3.4.4.5.
Initial hold (min) 15.  2.1.
Final hold (min)   30.10.
I 1287.1311.1288.1302.1296.
ReferenceAngioni, Barra, et al., 2004El-Ghorab, Mansour, et al., 2004Gauvin, Lecomte, et al., 2004Baranauskiene, Venskutonis, et al., 2003Bouzouita, Kachouri, et al., 2003
Comment MSDC-RI MSDC-RI MSDC-RI MSDC-RI MSDC-RI
Column type CapillaryCapillaryCapillaryCapillaryCapillary
Active phase HP-5HP-5HP-5Methyl SiliconeSE-30
Column length (m) 30.30.30.50.25.
Carrier gas HeHeHeHeHe
Substrate
Column diameter (mm) 0.250.250.250.250.22
Phase thickness (μm) 0.250.250.250.250.25
Tstart (C) 60.60.60.70.70.
Tend (C) 280.200.275.240.220.
Heat rate (K/min) 3.4.4.4.4.
Initial hold (min)  1.
Final hold (min)  15.
I 1296.1292.1298.1260.1280.
ReferenceÖzcan, Tzakou, et al., 2003Juliani and Simon, 2002Nickavar, Salehi-Sormagi, et al., 2002Palá-Paúl, Pérez-Alonso, et al., 2002Palá-Paúl, Velasco-Negueruela, et al., 2002
Comment MSDC-RI MSDC-RI MSDC-RI MSDC-RI MSDC-RI
Column type CapillaryCapillaryCapillaryCapillaryCapillary
Active phase BP-1BP-1HP-5DB-1DB-1
Column length (m) 25.30.25.28.30.
Carrier gas N2N2H2HeHe
Substrate
Column diameter (mm) 0.550.320.320.250.25
Phase thickness (μm) 0.250.250.520.250.25
Tstart (C) 60.60.40.50.40.
Tend (C) 220.220.240.270.260.
Heat rate (K/min) 5.5.4.4.52.
Initial hold (min)    1.5.
Final hold (min) 15.13.  20.
I 1281.1272.1290.1272.1284.
ReferenceRaina, Srivastava, et al., 2002Shawl, Srivastava, et al., 2002Kitic, Palic, et al., 2001Nagalakshmi, Thangadurai, et al., 2001Senatore and Rigano, 2001
Comment MSDC-RI MSDC-RI MSDC-RI MSDC-RI MSDC-RI
Column type CapillaryCapillaryCapillaryCapillaryCapillary
Active phase DB-5HP-5MSDB-5BP-1BP-1
Column length (m) 30.30.30.50.50.
Carrier gas HeHeHe
Substrate
Column diameter (mm) 0.260.320.250.250.25
Phase thickness (μm) 0.250.250.250.250.25
Tstart (C) 60.70.60.60.60.
Tend (C) 246.250.240.260.260.
Heat rate (K/min) 3.3.3.2.2.
Initial hold (min)  5.
Final hold (min)
I 1290.1296.1292.1284.1287.
ReferenceAdams, 2000Siani, Ramos, et al., 1999da Silva, Andrade, et al., 1999Vera and Chane-Ming, 1999Vera and Chane-Ming, 1999
Comment MSDC-RI MSDC-RI MSDC-RI MSDC-RI MSDC-RI
Column type CapillaryCapillary
Active phase BPX-5OV-101
Column length (m) 50.25.
Carrier gas N2N2
Substrate
Column diameter (mm) 0.220.25
Phase thickness (μm) 0.25
Tstart (C) 60.50.
Tend (C) 185.200.
Heat rate (K/min) 2.5.
Initial hold (min) 10.
Final hold (min)
I 1288.1280.
ReferenceFournier, Hadjiakhoondi, et al., 1997Menut, Molangui, et al., 1995
Comment MSDC-RI MSDC-RI

Van Den Dool and Kratz RI, polar column, temperature ramp

Data compiled by: NIST Mass Spectrometry Data Center, William E. Wallace, director

Column type CapillaryCapillaryCapillaryCapillaryCapillary
Active phase RTX-WaxBP-20RTX-WaxRTX-WaxHP-Wax
Column length (m) 60.50.60.60.30.
Carrier gas HeHeHeHeN2
Substrate
Column diameter (mm) 0.220.220.220.220.25
Phase thickness (μm) 0.250.250.250.250.25
Tstart (C) 60.60.60.60.60.
Tend (C) 230.220.230.230.220.
Heat rate (K/min) 2.2.2.2.5.
Initial hold (min)     10.
Final hold (min) 30.20.35.35.
I 2189.2186.2157.2157.2187.
ReferenceBendahou, Muselli, et al., 2008Boti, Koukoua, et al., 2007Paolini J., Costa J., et al., 2007Paolini, Muselli, et al., 2007Flamini, Tebano, et al., 2006
Comment MSDC-RI MSDC-RI MSDC-RI MSDC-RI MSDC-RI
Column type CapillaryCapillaryCapillaryCapillaryCapillary
Active phase BP-20Supelcowax-10BP-20RTX-WaxDB-Wax
Column length (m) 50.30.50.60.30.
Carrier gas HeHeHe He
Substrate
Column diameter (mm) 0.220.20.220.220.25
Phase thickness (μm) 0.250.20.250.250.25
Tstart (C) 60.70.60.60.40.
Tend (C) 220.220.220.220.250.
Heat rate (K/min) 2.3.2.2.3.
Initial hold (min)
Final hold (min) 20.15.20.20.20.
I 2186.2183.2183.2156.2153.
ReferenceGonny, Cavaleiro, et al., 2006Pinto, Pina-Vaz, et al., 2006Boti J.B., Koukoua G., et al., 2005Cozzani, Muselli, et al., 2005Fanciullino, Gancel, et al., 2005
Comment MSDC-RI MSDC-RI MSDC-RI MSDC-RI MSDC-RI
Column type CapillaryCapillaryCapillaryCapillaryCapillary
Active phase RTX-WaxMegawaxHP-WaxSupelcowaxCarbowax 20M
Column length (m) 60.30.30.30.25.
Carrier gas HeHeN2HeHe
Substrate
Column diameter (mm) 0.220.250.250.250.25
Phase thickness (μm) 0.250.250.250.250.3
Tstart (C) 60.40.60.40.50.
Tend (C) 230.220.220.240.200.
Heat rate (K/min) 2.2.5.2.3.
Initial hold (min)  6.10. 1.
Final hold (min) 35.10. 10.20.
I 2157.2164.2187.2160.2180.
ReferencePaolini, Costa, et al., 2005Verzera, Trozzi, et al., 2005Flamini, Luigi Cioni, et al., 2004Bassole, Ouattara, et al., 2003Bicchi, Rubiolo, et al., 2003
Comment MSDC-RI MSDC-RI MSDC-RI MSDC-RI MSDC-RI
Column type CapillaryCapillaryCapillaryCapillaryCapillary
Active phase OV-351DB-WaxInnowaxHP-InnowaxBP-20
Column length (m) 50.60.30.30.50.
Carrier gas HeH2HeHe
Substrate
Column diameter (mm) 0.320.320.250.250.22
Phase thickness (μm) 0.20.250.50.500.25
Tstart (C) 60.40.60.60.60.
Tend (C) 220.245.260.260.220.
Heat rate (K/min) 5.1.53.3.2.
Initial hold (min)
Final hold (min)  20.10. 20.
I 2189.2154.2172.2172.2189.
ReferenceBonvehi and Coll, 2003Gancel, Ollitrault, et al., 2003Couladis, Chinou, et al., 2002Couladis, Tzakou, et al., 2001Baldovini, Ristorcelli, et al., 2000
Comment MSDC-RI MSDC-RI MSDC-RI MSDC-RI MSDC-RI
Column type CapillaryCapillaryCapillaryCapillaryCapillary
Active phase BP-20BP-20DB-FFAPDB-FFAPCarbowax 20M
Column length (m) 50.50.30.30.60.
Carrier gas HeHeH2H2He
Substrate
Column diameter (mm) 0.220.220.320.320.32
Phase thickness (μm) 0.250.25  0.425
Tstart (C) 60.60.40.40.45.
Tend (C) 230.230.220.220.300.
Heat rate (K/min) 2.2.3.3.3.
Initial hold (min)     3.
Final hold (min) 35.35.  20.
I 2189.2189.2163.2165.2156.
ReferenceLota, de Rocca Serra, et al., 2000Lota, de Rocca Serra, et al., 2000Guillard, le Quere, et al., 1997Guillard, le Quere, et al., 1997Mondello, Dugo, et al., 1995
Comment MSDC-RI MSDC-RI MSDC-RI MSDC-RI MSDC-RI

Van Den Dool and Kratz RI, non-polar column, custom temperature program

Data compiled by: NIST Mass Spectrometry Data Center, William E. Wallace, director

Column type CapillaryCapillaryCapillaryCapillaryCapillary
Active phase BPX-5HP-5MSDB-5MSHP-5MS5 % Phenyl methyl siloxane
Column length (m) 30.30.30.30.30.
Carrier gas HeHeHeHeHe
Substrate
Column diameter (mm) 0.250.250.320.250.32
Phase thickness (μm) 0.250.250.50.250.15
Program 35C => 4C/min => 200C => 30C/min => 300C (3min)50C(4min) => 10C/min => 200C(0.5min) => 20C/min => 260C(5min)70C(1min) => 3C/min => 80C(1min) => 5C/min => 150C => 10C/min => 280C (4min)50C (3min) => 3C/min => 200C => 6C/min => 240C45C => 1C/min => 100C => 5C/min => 250C (10min)
I 1303.1280.1272.1290.1290.
ReferenceDharmawan, Kasapis, et al., 2007Pérez, Navarro, et al., 2007Varlet V., Knockaert C., et al., 2006Akpulat, Tepe, et al., 2005Sacchetti, Maietti, et al., 2005
Comment MSDC-RI MSDC-RI MSDC-RI MSDC-RI MSDC-RI
Column type CapillaryCapillaryCapillaryCapillary
Active phase SE-52DB-5MSDB-5SE-52
Column length (m) 25.30.25.60.
Carrier gas H2HeHeHe
Substrate
Column diameter (mm) 0.320.250.250.32
Phase thickness (μm) 0.430.250.250.40
Program 60C(8min) => 3C/min => 180C => 20C/min => 250C(10min)40C(5min) => 4C/min => 160C => 8C/min => 240C (15min)60C => 3C/min => 106C => 6C/min => 280C45 C (6 min) 3 C/min -> 111 0C 2 C/min -> 160 C 3 C/min -> 300 C (15 min)
I 1294.1290.1290.1290.
ReferenceFrizzo, Lorenzo, et al., 2004Kim, Lee, et al., 2003Afsharypuor, Jeiran, et al., 1998Mondello, Dugo, et al., 1995
Comment MSDC-RI MSDC-RI MSDC-RI MSDC-RI

Kovats' RI, polar column, temperature ramp

Data compiled by: NIST Mass Spectrometry Data Center, William E. Wallace, director

Column type CapillaryCapillary
Active phase StabilwaxHP-Wax
Column length (m) 30.50.
Carrier gas N2He
Substrate
Column diameter (mm) 0.320.2
Phase thickness (μm) 1.0.4
Tstart (C) 50.60.
Tend (C) 220.230.
Heat rate (K/min) 2.4.
Initial hold (min) 3.
Final hold (min) 15.30.
I 2212.2198.
ReferenceHazzit, Baaliouamer, et al., 2006Gauvin, Lecomte, et al., 2004
Comment MSDC-RI MSDC-RI

Van Den Dool and Kratz RI, polar column, custom temperature program

Data compiled by: NIST Mass Spectrometry Data Center, William E. Wallace, director

Column type Capillary
Active phase Stabilwax
Column length (m)
Carrier gas He
Substrate
Column diameter (mm)
Phase thickness (μm)
Program 50C(8min) => 4C/min => 180C(10min) => 5C/min => 220C
I 2152.
ReferenceHudaib, Speroni, et al., 2002
Comment MSDC-RI

References

Bertholon, Giray, et al., 1971
Bertholon, G.; Giray, M.; Perrin, R.; Vincent-Falquet-Berny, M.F.,
No. 532. - Etude physicochimique des phenols. OX. - Ethanlpies de combustion et energies de resonance des alcoyl et aryphenols,
Bull. Soc. Chim. France, 1971, 3180-3187. [all data]
Fischer, Cotton, et al., 1959
Fischer, A.K.; Cotton, F.A.; Wilkinson, G.,
Heats of combustion and formation of bis-benzenechromium,
J. Phys. Chem., 1959, 63, 154-155. [all data]
Radice, 1899
Radice, G.,
, Ph. D. Thesis, Univ. of Geneve, 1899. [all data]
Hoskovec, Grygarová, et al., 2005
Hoskovec, Michal; Grygarová, Dana; Cvacka, Josef; Streinz, Ludvík; Zima, Jirí; Verevkin, Sergey P.; Koutek, Bohumír,
Determining the vapour pressures of plant volatiles from gas chromatographic retention data,
Journal of Chromatography A, 2005, 1083, 1-2, 161-172, https://doi.org/10.1016/j.chroma.2005.06.006
. [all data]
van Roon, Parsons, et al., 2002
van Roon, André; Parsons, John R.; Govers, Harrie A.J.,
Gas chromatographic determination of vapour pressure and related thermodynamic properties of monoterpenes and biogenically related compounds,
Journal of Chromatography A, 2002, 955, 1, 105-115, https://doi.org/10.1016/S0021-9673(02)00200-5
. [all data]
Chickos, Hosseini, et al., 1995
Chickos, James S.; Hosseini, Sarah; Hesse, Donald G.,
Determination of vaporization enthalpies of simple organic molecules by correlations of changes in gas chromatographic net retention times,
Thermochimica Acta, 1995, 249, 41-62, https://doi.org/10.1016/0040-6031(95)90670-3
. [all data]
Sherwood and Bryant, 1957
Sherwood, T.K.; Bryant, J.H., Jr.,
Can. J. Chem. Eng., 1957, 35, 51. [all data]
Stephenson and Malanowski, 1987
Stephenson, Richard M.; Malanowski, Stanislaw,
Handbook of the Thermodynamics of Organic Compounds, 1987, https://doi.org/10.1007/978-94-009-3173-2
. [all data]
Stage, Müller, et al., 1953
Stage, H.; Müller, E.; Faldix, P.,
Erdol u Kohle, 1953, 6, 375. [all data]
Stull, 1947
Stull, Daniel R.,
Vapor Pressure of Pure Substances. Organic and Inorganic Compounds,
Ind. Eng. Chem., 1947, 39, 4, 517-540, https://doi.org/10.1021/ie50448a022
. [all data]
Aihara, 1960
Aihara, Ariyuki,
Estimation of the Energy of Hydrogen Bonds Formed in Crystals. II. Phenols,
Bull. Chem. Soc. Jpn., 1960, 33, 2, 194-200, https://doi.org/10.1246/bcsj.33.194
. [all data]
Chickos, 1975
Chickos, James Speros,
A simple equilibrium method for determining heats of sublimation,
J. Chem. Educ., 1975, 52, 2, 134-39, https://doi.org/10.1021/ed052p134
. [all data]
Cox and Pilcher, 1970
Cox, J.D.; Pilcher, G.,
Thermochemistry of Organic and Organometallic Compounds, Academic Press Inc., London, 1970, 643. [all data]
Jones, 1960
Jones, A.H.,
Sublimation Pressure Data for Organic Compounds.,
J. Chem. Eng. Data, 1960, 5, 2, 196-200, https://doi.org/10.1021/je60006a019
. [all data]
Balson, 1947
Balson, E.W.,
Studies in vapour pressure measurement, Part III.?An effusion manometer sensitive to 5 «65533» 10?6 millimetres of mercury: vapour pressure of D.D.T. and other slightly volatile substances,
Trans. Faraday Soc., 1947, 43, 54, https://doi.org/10.1039/tf9474300054
. [all data]
Chickos, Braton, et al., 1991
Chickos, James S.; Braton, C. Marie; Hesse, Donald G.; Liebman, Joel F.,
Estimating entropies and enthalpies of fusion of organic compounds,
J. Org. Chem., 1991, 56, 3, 927-938, https://doi.org/10.1021/jo00003a007
. [all data]