Phenol, 2-(1-methylpropyl)-
- Formula: C10H14O
- Molecular weight: 150.2176
- IUPAC Standard InChIKey: NGFPWHGISWUQOI-UHFFFAOYSA-N
- CAS Registry Number: 89-72-5
- Chemical structure:
View 3d structure (requires JavaScript / HTML 5) - Other names: Phenol, o-sec-butyl-; o-sec-Butylphenol; 2-sec-Butylphenol; 2-sec.Butylfenol; 2-(1-Methylpropyl)phenol

Gas phase thermochemistry data

Data compiled by: Hussein Y. Afeefy, Joel F. Liebman, and Stephen E. Stein
Quantity | Value | Units | Method | Reference | Comment |
---|---|---|---|---|---|
ΔfH°gas | -191.4 | kJ/mol | Cm | Kukui, Potolovskii, et al., 1973 |

Condensed phase thermochemistry data

Data compiled by: Hussein Y. Afeefy, Joel F. Liebman, and Stephen E. Stein
Quantity | Value | Units | Method | Reference | Comment |
---|---|---|---|---|---|
ΔfH°liquid | -251.3 | kJ/mol | Cm | Kukui, Potolovskii, et al., 1973 |

Phase change data

Data compiled as indicated in comments:
BS - Robert L. Brown and Stephen E. Stein
TRC - Thermodynamics Research Center, NIST Boulder Laboratories, Chris Muzny director
DRB - Donald R. Burgess, Jr.
AC - William E. Acree, Jr., James S. Chickos
Quantity | Value | Units | Method | Reference | Comment |
---|---|---|---|---|---|
Tboil | 500. ± 4. | K | AVG | N/A | Average of 6 values; Individual data points |
Quantity | Value | Units | Method | Reference | Comment |
Tfus | 291.15 | K | N/A | Dewar and Puttnam, 1959 | Uncertainty assigned by TRC = 3. K; TRC |
Quantity | Value | Units | Method | Reference | Comment |
ΔvapH° | 59.9 | kJ/mol | N/A | Kukui, Potolovskii, et al., 1973 | DRB |
Enthalpy of vaporization
ΔvapH (kJ/mol) | Temperature (K) | Method | Reference | Comment |
---|---|---|---|---|
52.1 | 466. | A,GS,EB | Stephenson and Malanowski, 1987 | Based on data from 451. to 513. K. See also Handley, Harrop, et al., 1964.; AC |
Antoine Equation Parameters
log10(P) = A − (B / (T + C))
P = vapor pressure (bar)
T = temperature (K)
View plot Requires a JavaScript / HTML 5 canvas capable browser.
Temperature (K) | A | B | C | Reference | Comment |
---|---|---|---|---|---|
451.88 to 512.66 | 4.07618 | 1593.245 | -109.414 | Handley, Harrop, et al., 1964, 2 | Coefficents calculated by NIST from author's data. |

Reaction thermochemistry data

Data compiled by: Hussein Y. Afeefy, Joel F. Liebman, and Stephen E. Stein
Individual Reactions
By formula: C6H6O + C14H22O = C10H14O + C10H14O
Quantity | Value | Units | Method | Reference | Comment |
---|---|---|---|---|---|
ΔrH° | -2.6 ± 1.1 | kJ/mol | Eqk | Nesterova, Pimerzin, et al., 1989 | liquid phase; Isomerization |
+ C18H30O =
+
By formula: C6H6O + C18H30O = C14H22O + C10H14O
Quantity | Value | Units | Method | Reference | Comment |
---|---|---|---|---|---|
ΔrH° | -1.7 ± 1.5 | kJ/mol | Eqk | Nesterova, Pimerzin, et al., 1989 | liquid phase; Isomerization |
By formula: C6H6O + C14H22O = C10H14O + C10H14O
Quantity | Value | Units | Method | Reference | Comment |
---|---|---|---|---|---|
ΔrH° | -3.2 ± 1.9 | kJ/mol | Eqk | Nesterova, Pimerzin, et al., 1989 | liquid phase; Isomerization |
By formula: C10H14O = C10H14O
Quantity | Value | Units | Method | Reference | Comment |
---|---|---|---|---|---|
ΔrH° | -4.6 ± 0.8 | kJ/mol | Eqk | Nesterova, Pimerzin, et al., 1989 | liquid phase; Isomerization |
By formula: C10H14O = C4H8 + C6H6O
Quantity | Value | Units | Method | Reference | Comment |
---|---|---|---|---|---|
ΔrH° | 77.8 | kJ/mol | Cm | Kukui, Potolovskii, et al., 1973 | liquid phase |

Normal alkane RI, non-polar column, temperature ramp

Column type | Active phase | I | Reference | Comment |
---|---|---|---|---|
Capillary | Ultra-1 | 1252. | Okumura, 1991 | 25. m/0.32 mm/0.25 μm, He, 3. K/min; Tstart: 80. C; Tend: 260. C |

References

Kukui, Potolovskii, et al., 1973
Kukui, N.M.; Potolovskii, L.A.; Vasileva, V.N.,
Thermochemical and thermodynamic calculation of the alkylation of phenol by normal α-olefins,
Khim. Tekhnol. Topl. Masel, 1973, 18, 10-13. [all data]
Dewar and Puttnam, 1959
Dewar; Puttnam,
J. Chem. Soc., 1959, 1959, 4080. [all data]
Stephenson and Malanowski, 1987
Stephenson, Richard M.; Malanowski, Stanislaw,
Handbook of the Thermodynamics of Organic Compounds, 1987, https://doi.org/10.1007/978-94-009-3173-2
. [all data]
Handley, Harrop, et al., 1964
Handley, R.; Harrop, D.; Martin, J.F.; Sprake, C.H.S.,
846. Thermodynamic properties of organic oxygen compounds. Part XIV. Purification and vapour pressures of some alkylphenols,
J. Chem. Soc., 1964, 4404, https://doi.org/10.1039/jr9640004404
. [all data]
Handley, Harrop, et al., 1964, 2
Handley, R.; Harrop, D.; Martin, J.F.; Sprake, C.H.S.,
Thermodynamic Properties of Organic Oxygen Compounds. Part XIV. Purification and Vapour Pressures of Some Alkylphenols,
J. Chem. Soc., 1964, 4404-4406, https://doi.org/10.1039/jr9640004404
. [all data]
Nesterova, Pimerzin, et al., 1989
Nesterova, T.N.; Pimerzin, A.A.; Rozhnov, A.M.; Karlina, T.N.,
Equilibria for the isomerization of (secondary-alkyl)phenols and cyclohexylphenols,
J. Chem. Thermodyn., 1989, 21, 385-395. [all data]
Okumura, 1991
Okumura, T.,
retention indices of environmental chemicals on methyl silicone capillary column,
Journal of Environmental Chemistry (Japan), 1991, 1, 2, 333-358, https://doi.org/10.5985/jec.1.333
. [all data]