CAS Reg. No. 89713-32-6
- CAS Registry Number: 89713-32-6

Reaction thermochemistry data

Data compiled by: John E. Bartmess
Individual Reactions
CAS Reg. No. 89713-32-6 + = H4O3P-
By formula: CAS Reg. No. 89713-32-6 + H2O = H4O3P-
Quantity | Value | Units | Method | Reference | Comment |
---|---|---|---|---|---|
ΔrH° | 15.4 ± 1.5 | kcal/mol | TDAs | Blades, Klassen, et al., 1995 | gas phase; T: 293 K. ΔSaff approx. 24 cal/mol-K |
Quantity | Value | Units | Method | Reference | Comment |
ΔrG° | 8.40 ± 0.30 | kcal/mol | TDAs | Blades, Klassen, et al., 1995 | gas phase; T: 293 K. ΔSaff approx. 24 cal/mol-K |

References

Blades, Klassen, et al., 1995
Blades, A.T.; Klassen, J.S.; Kebarle, P.,
Free Energies of Hydration in the Gas Phase on the Anions of Some Oxo Acids of C, N, S, P, Cl and I,
J. Am. Chem. Soc., 1995, 117, 42, 10563, https://doi.org/10.1021/ja00147a019
. [all data]