Benzene, 1,4-dichloro-2-nitro-
- Formula: C6H3Cl2NO2
- Molecular weight: 192.000
- IUPAC Standard InChIKey: RZKKOBGFCAHLCZ-UHFFFAOYSA-N
- CAS Registry Number: 89-61-2
- Chemical structure:
View 3d structure (requires JavaScript / HTML 5) - Other names: Nitro-p-dichlorobenzene; 1,4-Dichloro-2-nitrobenzene; 2,5-Dichloronitrobenzene; Benzene, 2,5-dichloronitro-; 1-Nitro-2,5-dichlorobenzene; 2,5-Dichlornitrobenzen; Benzene, 1-nitro-2,5-dichloro-; NSC 406125; 2,5-dichloronitrobenezene

Phase change data

Data compiled as indicated in comments:
BS - Robert L. Brown and Stephen E. Stein
TRC - Thermodynamics Research Center, NIST Boulder Laboratories, Chris Muzny director
AC - William E. Acree, Jr., James S. Chickos
Quantity | Value | Units | Method | Reference | Comment |
---|---|---|---|---|---|
Tboil | 540.2 | K | N/A | Weast and Grasselli, 1989 | BS |
Quantity | Value | Units | Method | Reference | Comment |
Tfus | 326.65 | K | N/A | Witschonke, 1954 | Uncertainty assigned by TRC = 0.2 K; TRC |
Tfus | 326.75 | K | N/A | Witschonke, 1954 | Uncertainty assigned by TRC = 0.15 K; TRC |
Tfus | 327. | K | N/A | Buechner, 1906 | Uncertainty assigned by TRC = 2. K; TRC |
Quantity | Value | Units | Method | Reference | Comment |
ΔsubH° | 87.4 ± 2.4 | kJ/mol | C | Ribeiro da Silva, Lobo Ferreira, et al., 2009 | AC |

References

Weast and Grasselli, 1989
CRC Handbook of Data on Organic Compounds, 2nd Editon, Weast,R.C and Grasselli, J.G., ed(s)., CRC Press, Inc., Boca Raton, FL, 1989, 1. [all data]
Witschonke, 1954
Witschonke, C.R.,
Freezing point and purity data for some organic compounds,
Anal. Chem., 1954, 26, 562-4. [all data]
Buechner, 1906
Buechner, E.H.,
Z. Phys. Chem., Stoechiom. Verwandtschaftsl., 1906, 54, 665. [all data]
Ribeiro da Silva, Lobo Ferreira, et al., 2009
Ribeiro da Silva, Manuel A.V.; Lobo Ferreira, Ana I.M.C.; Moreno, Ana Rita G.,
Experimental and computational thermochemical study of the dichloronitrobenzene isomers,
The Journal of Chemical Thermodynamics, 2009, 41, 8, 904-910, https://doi.org/10.1016/j.jct.2009.03.001
. [all data]