Benzene, 1,4-dimethyl-2-nitro-
- Formula: C8H9NO2
- Molecular weight: 151.1626
- IUPAC Standard InChIKey: BSFHJMGROOFSRA-UHFFFAOYSA-N
- CAS Registry Number: 89-58-7
- Chemical structure:
View 3d structure (requires JavaScript / HTML 5) - Other names: p-Xylene, 2-nitro-; Nitro-p-xylene; 1,4-Dimethyl-2-nitrobenzene; 2-Nitro-p-xylene; 2-Nitro-1,4-dimethylbenzene; 2,5-Dimethyl-1-nitrobenzene; 2-Nitro-para-xylene; 2,5-Dimethylnitrobenzene; 1-Nitro-2,5-dimethylbenzene; NSC 5591

Phase change data

Data compiled by: Robert L. Brown and Stephen E. Stein
Reduced pressure boiling point
Tboil (K) | Pressure (bar) | Reference |
---|---|---|
337.7 | 0.0004 | Weast and Grasselli, 1989 |
394. to 397. | 0.021 | Frinton Laboratories Inc., 1986 |

References

Weast and Grasselli, 1989
CRC Handbook of Data on Organic Compounds, 2nd Editon, Weast,R.C and Grasselli, J.G., ed(s)., CRC Press, Inc., Boca Raton, FL, 1989, 1. [all data]
Frinton Laboratories Inc., 1986
Frinton Laboratories Inc.,
Catalog Number 11, Frinton Laboratories Inc., Vineland, NJ, 1986, 99. [all data]