Triphenyl lead iodide

Phase change data

Data compiled by: William E. Acree, Jr., James S. Chickos

Quantity Value Units Method Reference Comment
Δsub130.1 ± 0.4kJ/molMEGolovanova, Sitonina, et al., 1988Based on data from 298. - 398. K. See also Butler, Carson, et al., 1976.

References

Golovanova, Sitonina, et al., 1988
Golovanova, O.F.; Sitonina, G.V.; Pepekin, v.I.; Korsunskii, B.L.; Dubovitskii, F.I., Kinetic and thermochemical studies of N-nitro and N-nitrosomorpholine, Bull. Acad. Sci. USSR, Div. Chem. Sci., 1988, 881-886. [all data]

Butler, Carson, et al., 1976
Butler, R.S.; Carson, A.S.; Laye, P.G.; Steele, W.V., Thermochemical studies on the halogenation of tetraphenyllead, The Journal of Chemical Thermodynamics, 1976, 8, 12, 1153-1158, https://doi.org/10.1016/0021-9614(76)90122-1 . [all data]