Triphenyl lead bromide
- Formula: C18H15BrPb
- Molecular weight: 518.4
- CAS Registry Number: 894-06-4

Phase change data

Data compiled as indicated in comments:
AC - William E. Acree, Jr., James S. Chickos
MS - José A. Martinho Simões
Quantity | Value | Units | Method | Reference | Comment |
---|---|---|---|---|---|
ΔsubH° | 134.7 ± 3.3 | kJ/mol | ME | Golovanova, Sitonina, et al., 1988 | Based on data from 298. to 398. K. See also Butler, Carson, et al., 1976.; AC |
ΔsubH° | 134.7 ± 3.3 | kJ/mol | RSC | Butler R.S., Carson, et al., 1976 | MS |

References

Golovanova, Sitonina, et al., 1988
Golovanova, O.F.; Sitonina, G.V.; Pepekin, v.I.; Korsunskii, B.L.; Dubovitskii, F.I.,
Kinetic and thermochemical studies of N-nitro and N-nitrosomorpholine,
Bull. Acad. Sci. USSR, Div. Chem. Sci., 1988, 881-886. [all data]
Butler, Carson, et al., 1976
Butler, R.S.; Carson, A.S.; Laye, P.G.; Steele, W.V.,
Thermochemical studies on the halogenation of tetraphenyllead,
The Journal of Chemical Thermodynamics, 1976, 8, 12, 1153-1158, https://doi.org/10.1016/0021-9614(76)90122-1
. [all data]
Butler R.S., Carson, et al., 1976
Butler R.S.; Carson, A.S.; Laye, P.G.; Steele, W.V.,
J. Chem. Thermodyn., 1976, 8, 1153. [all data]