Orcinol, 2TMS derivative
- Formula: C13H24O2Si2
- Molecular weight: 268.4995
- IUPAC Standard InChIKey: ILCZPWVHDICNLU-UHFFFAOYSA-N
- CAS Registry Number: 89267-67-4
- Chemical structure:
View 3d structure (requires JavaScript / HTML 5) - Other names: Benzene, 1-methyl-3,5-bis[(trimethylsilyl)oxy]-; 1-Methyl-3,5-dihydroxybenzene, bisTMS ether; Orcinol, bis(trimethylsilyl) ether; Orcinol monohydrate, bis(trimethylsilyl) ether; Trimethyl(3-methyl-5-[(trimethylsilyl)oxy]phenoxy)silane

Van Den Dool and Kratz RI, non-polar column, temperature ramp

Column type | Active phase | I | Reference | Comment |
---|---|---|---|---|
Packed | OV-1 | 1446. | Mattsson and Petersson, 1977 | N2, Supelcoport, 4. K/min; Column length: 2. m; Tstart: 80. C; Tend: 240. C |

Van Den Dool and Kratz RI, non-polar column, custom temperature program

Column type | Active phase | I | Reference | Comment |
---|---|---|---|---|
Capillary | VF-5MS | 1436.2 | Tret'yakov, 2008 | 30. m/0.25 mm/0.25 μm, He; Program: Multi-step temperature program; T(initial)=60C; T(final)=270C |

References

Mattsson and Petersson, 1977
Mattsson, M.; Petersson, G.,
Reference GLC Data for the Analysis of Phenolic Compounds as Trimethylsilyl Derivatives,
J. Chromatogr. Sci., 1977, 15, 12, 546-554, https://doi.org/10.1093/chromsci/15.12.546
. [all data]
Tret'yakov, 2008
Tret'yakov, K.V.,
Retention Data. NIST Mass Spectrometry Data Center., NIST Mass Spectrometry Data Center, 2008. [all data]