Tetramethylammonium hexacyanotrimethylenecyclopropanide

Phase change data

Data compiled by: Eugene S. Domalski and Elizabeth D. Hearing

Enthalpy of phase transition

ΔHtrs (kcal/mol) Temperature (K) Initial Phase Final Phase Reference Comment
0.3227363.7crystaline, IIcrystaline, IAbrahams, Bair, et al., 1984

Entropy of phase transition

ΔStrs (cal/mol*K) Temperature (K) Initial Phase Final Phase Reference Comment
0.81363.7crystaline, IIcrystaline, IAbrahams, Bair, et al., 1984

References

Abrahams, Bair, et al., 1984
Abrahams, S.C.; Bair, H.E.; DiSalvo, F.J.; Marsh, P.; Duering, L.A., Magnetic and structural phase transition at 363.7 K in tetramethylammonium hexacyanotrimethylenecyclopropanide, Phys. Rev. B: Condens. Matter, 1984, 29(3), 1258-1262. [all data]