1,1,1,2,2,3,3,4,4,5,5,6,6,7,7,8,8,9,9,10,10,11,11,12,12-Pentacosofluorotetracosane

Phase change data

Data compiled as indicated in comments:
TRC - Thermodynamics Research Center, NIST Boulder Laboratories, Chris Muzny director
AC - William E. Acree, Jr., James S. Chickos

Quantity Value Units Method Reference Comment
Tfus362.KN/ARussell, Rabolt, et al., 1986Uncertainty assigned by TRC = 0.1 K; TRC

Enthalpy of fusion

ΔfusH (kJ/mol) Temperature (K) Method Reference Comment
23.2361.DSCNúñez, Clark, et al., 2008AC
26.0364.1DSCHopken and Moller, 1992AC
24.5362.2DSCRussell, Rabolt, et al., 1986, 2AC

In addition to the Thermodynamics Research Center (TRC) data available from this site, much more physical and chemical property data is available from the following TRC products:

References

Russell, Rabolt, et al., 1986
Russell, T.P.; Rabolt, J.F.; Twieg, R.J.; Siemens, R.L.; Farmer, B.L., Structural characterization of semifluorinated n-alkanes. 2. Solid-solid transition behavior, Macromolecules, 1986, 19, 4, 1135, https://doi.org/10.1021/ma00158a035 . [all data]

Núñez, Clark, et al., 2008
Núñez, E.; Clark, C.G., Jr.; Cheng, W.; Best, A.; Floudas, G.; Semenov, A.N.; Fytas, G.; Müllen, K., Thermodynamic, Structural, and Nanomechanical Properties of a Fluorous Biphasic Material «8224», J. Phys. Chem. B, 2008, 112, 21, 6542-6549, https://doi.org/10.1021/jp711945z . [all data]

Hopken and Moller, 1992
Hopken, Jens; Moller, Martin, On the morphology of (perfluoroalkyl)alkanes, Macromolecules, 1992, 25, 9, 2482-2489, https://doi.org/10.1021/ma00035a029 . [all data]

Russell, Rabolt, et al., 1986, 2
Russell, Thomas P.; Rabolt, John F.; Twieg, Robert J.; Siemens, Richard L.; Farmer, Barry L., Structural characterization of semifluorinated n-alkanes. 2. Solid-solid transition behavior, Macromolecules, 1986, 19, 4, 1135-1143, https://doi.org/10.1021/ma00158a035 . [all data]