1,3-Diiodocyclobutane
- Formula: C4H6I2
- Molecular weight: 307.8994
- IUPAC Standard InChIKey: YHRNIJSEINOLJF-UHFFFAOYSA-N
- CAS Registry Number: 89066-32-0
- Chemical structure:
View 3d structure (requires JavaScript / HTML 5) - Permanent link for this species. Use this link for bookmarking this species for future reference.

Gas phase thermochemistry data

Data compiled by: Hussein Y. Afeefy, Joel F. Liebman, and Stephen E. Stein
Quantity | Value | Units | Method | Reference | Comment |
---|---|---|---|---|---|
ΔfH°gas | 193. ± 8.4 | kJ/mol | Cm | Sunner and Wulff, 1973 |

Condensed phase thermochemistry data

Data compiled by: Hussein Y. Afeefy, Joel F. Liebman, and Stephen E. Stein
Quantity | Value | Units | Method | Reference | Comment |
---|---|---|---|---|---|
ΔfH°liquid | 135. ± 6.3 | kJ/mol | Cm | Sunner and Wulff, 1973 |

Phase change data

Data compiled by: Hussein Y. Afeefy, Joel F. Liebman, and Stephen E. Stein
Quantity | Value | Units | Method | Reference | Comment |
---|---|---|---|---|---|
ΔvapH° | 58.6 ± 4.2 | kJ/mol | E | Sunner and Wulff, 1973 |

Reaction thermochemistry data

Data compiled by: Hussein Y. Afeefy, Joel F. Liebman, and Stephen E. Stein
Individual Reactions
By formula: C4H6I2 = C4H6 + I2
Quantity | Value | Units | Method | Reference | Comment |
---|---|---|---|---|---|
ΔrH° | 59.0 ± 4.2 | kJ/mol | Cm | Sunner and Wulff, 1973 | liquid phase |

References

Sunner and Wulff, 1973
Sunner, S.; Wulff, C.A.,
Ring strain in diiodocyclobutane,
Acta Chem. Scand., 1973, 27, 315-317. [all data]