1,2,4,5-Benzene-tetracarboxylic acid
- Formula: C10H6O8
- Molecular weight: 254.1498
- IUPAC Standard InChIKey: CYIDZMCFTVVTJO-UHFFFAOYSA-N
- CAS Registry Number: 89-05-4
- Chemical structure:
View 3d structure (requires JavaScript / HTML 5) - Other names: Pyromellitic acid; 1,2,4,5-Tetracarboxybenzene; Benzene-1,2,4,5-tetracarboxylic acid; USAF xr-20

Condensed phase thermochemistry data

Data compiled by: Hussein Y. Afeefy, Joel F. Liebman, and Stephen E. Stein
Quantity | Value | Units | Method | Reference | Comment |
---|---|---|---|---|---|
ΔfH°solid | -1570.8 ± 0.88 | kJ/mol | Ccb | Yukhno and Bikkulov, 1971 | |
Quantity | Value | Units | Method | Reference | Comment |
ΔcH°solid | -3221.8 ± 0.88 | kJ/mol | Ccb | Yukhno and Bikkulov, 1971 | Corresponding ΔfHºsolid = -1570.8 kJ/mol (simple calculation by NIST; no Washburn corrections) |

Phase change data

Data compiled by: Thermodynamics Research Center, NIST Boulder Laboratories, Chris Muzny director
Quantity | Value | Units | Method | Reference | Comment |
---|---|---|---|---|---|
Tfus | 544.15 | K | N/A | Smith and Kiess, 1939 | Uncertainty assigned by TRC = 2. K |

References

Yukhno and Bikkulov, 1971
Yukhno, G.F.; Bikkulov, A.Z.,
Enthalpies of combustion and formation of benzenecarboxylic acids,
Russ. J. Phys. Chem. (Engl. Transl.), 1971, 45, 924-925. [all data]
Smith and Kiess, 1939
Smith, L.I.; Kiess, M.A.,
Polymethylbenzenes. XXIII. The Preparation and Physical Propeties of 3- and 5-Ethylpseudocumenes and of Ethylmesitylene,
J. Am. Chem. Soc., 1939, 61, 284. [all data]