1,2-Benzenedicarboxylic acid
- Formula: C8H6O4
- Molecular weight: 166.1308
- IUPAC Standard InChIKey: XNGIFLGASWRNHJ-UHFFFAOYSA-N
- CAS Registry Number: 88-99-3
- Chemical structure:

Condensed phase thermochemistry data

Data compiled as indicated in comments:
ALS - Hussein Y. Afeefy, Joel F. Liebman, and Stephen E. Stein
DH - Eugene S. Domalski and Elizabeth D. Hearing
Quantity | Value | Units | Method | Reference | Comment |
---|---|---|---|---|---|
ΔfH°solid | -782.12 | kJ/mol | Ccb | Schwabe and Wagner, 1961 | ALS |
ΔfH°solid | -781.91 | kJ/mol | Ccb | Parks, Mosley, et al., 1950 | see Richardson and Parks, 1939; ALS |
Quantity | Value | Units | Method | Reference | Comment |
ΔcH°solid | -3223.5 ± 0.50 | kJ/mol | Ccb | Schwabe and Wagner, 1961 | Corresponding ΔfHºsolid = -782.03 kJ/mol (simple calculation by NIST; no Washburn corrections); ALS |
ΔcH°solid | -3223.7 | kJ/mol | Ccb | Parks, Mosley, et al., 1950 | see Richardson and Parks, 1939; Corresponding ΔfHºsolid = -781.82 kJ/mol (simple calculation by NIST; no Washburn corrections); ALS |
ΔcH°solid | -3229.96 | kJ/mol | Ccb | Verkade, 1926 | Corresponding ΔfHºsolid = -775.61 kJ/mol (simple calculation by NIST; no Washburn corrections); ALS |
Quantity | Value | Units | Method | Reference | Comment |
S°solid,1 bar | 207.94 | J/mol*K | N/A | Parks, Todd, et al., 1936 | Extrapolation below 90 K, 66.19 J/mol*K.; DH |
Constant pressure heat capacity of solid
Cp,solid (J/mol*K) | Temperature (K) | Reference | Comment |
---|---|---|---|
201.7 | 323. | Satoh and Sogabe, 1941 | T = 0 to 100 C. Mean value.; DH |
201.7 | 323. | Satoh and Sogabe, 1939 | T = 0 to 100 C. Mean value.; DH |
188.11 | 298.1 | Parks, Todd, et al., 1936 | T = 90 to 300 K.; DH |

Phase change data

Data compiled as indicated in comments:
TRC - Thermodynamics Research Center, NIST Boulder Laboratories, Chris Muzny director
AC - William E. Acree, Jr., James S. Chickos
Quantity | Value | Units | Method | Reference | Comment |
---|---|---|---|---|---|
Tfus | 480. | K | N/A | Parks, Todd, et al., 1936, 2 | Uncertainty assigned by TRC = 3. K; TRC |
Quantity | Value | Units | Method | Reference | Comment |
ΔsubH° | 129.8 ± 0.6 | kJ/mol | C | Sabbah and Perez, 1999 | AC |
Enthalpy of fusion
ΔfusH (kJ/mol) | Temperature (K) | Reference | Comment |
---|---|---|---|
36.5 | 463.5 | Sabbah and Perez, 1999 | AC |

Reaction thermochemistry data

Data compiled by: Hussein Y. Afeefy, Joel F. Liebman, and Stephen E. Stein
Individual Reactions
By formula: C8H6O4 = H2O + C8H4O3
Quantity | Value | Units | Method | Reference | Comment |
---|---|---|---|---|---|
ΔrH° | 31.93 ± 0.29 | kJ/mol | Cm | Alekseev, Kizaev, et al., 1989 | solid phase; solvent: Aqueous; Enthapy of anhydridisation |

Normal alkane RI, non-polar column, temperature ramp

Column type | Active phase | I | Reference | Comment |
---|---|---|---|---|
Capillary | SPB-1 | 1643. | Escalona-Arranz, Perez-Roses, et al., 2010 | 30. m/0.32 mm/0.25 μm, Helium, 30. C @ 3. min, 4. K/min, 250. C @ 10. min |

Lee's RI, non-polar column, temperature ramp

Column type | Active phase | I | Reference | Comment |
---|---|---|---|---|
Capillary | HP-5 | 225.33 | Pedersen, Durant, et al., 2005 | 30. m/0.25 mm/0.25 μm, Helium, 50. C @ 1.5 min, 6. K/min, 310. C @ 10. min |

References

Schwabe and Wagner, 1961
Schwabe, K.; Wagner, W.,
Verbrennungs- und bildungswarmen der drei isomeren phthalsauren,
Z. Electrochem., 1961, 65, 812-815. [all data]
Parks, Mosley, et al., 1950
Parks, G.S.; Mosley, J.R.; Peterson, P.V., Jr.,
Heats of combustion and formation of some organic compounds containing oxygen,
J. Chem. Phys., 1950, 18, 152. [all data]
Richardson and Parks, 1939
Richardson, J.W.; Parks, G.S.,
Thermal data on organic compounds. XIX. Modern combustion data for some non-volatile compounds containing carbon, hydrogen and oxygen,
J. Am. Chem. Soc., 1939, 61, 3543-3546. [all data]
Verkade, 1926
Verkade, P.E.,
Verbrandingswarmten van plaatsings-isomere benzol-derivaten en de theorie der geinduceerde alterneeren de polatiteit,
Verslag Akad. Wetenschappen Amsterdam, 1926, 35, 492-504. [all data]
Parks, Todd, et al., 1936
Parks, G.S.; Todd, S.S.; Moore, W.A.,
Thermal data on organic compounds. XVI. Some heat capacity, entropy and free energy data for typical benzene derivatives and heterocyclic compounds,
J. Am. Chem. Soc., 1936, 58, 398-401. [all data]
Satoh and Sogabe, 1941
Satoh, S.; Sogabe, T.,
The heat capacities of some organic compounds containing nitrogen and the atomic heat of nitrogen. (4), Sci.,
Pap. Inst. Phys. Chem. Res. (Tokyo), 1941, 38, 246-251. [all data]
Satoh and Sogabe, 1939
Satoh, S.; Sogabe, T.,
The specific heats of some solid aromatic acids and their ammonium salts and the atomic heat of nitrogen,
Sci. Pap. Inst. Phys. Chem. Res. (Tokyo), 1939, 36, 449-457. [all data]
Parks, Todd, et al., 1936, 2
Parks, G.S.; Todd, S.S.; Shomate, C.H.,
Thermal data on organic compounds. XVII. Some heat capacity, entropy and free energy data for five higher olefins,
J. Am. Chem. Soc., 1936, 58, 2505. [all data]
Sabbah and Perez, 1999
Sabbah, Raphaël; Perez, Laurence,
Étude thermodynamique des acides phtalique, isophtalique et téréphtalique,
Revue canadienne de chimie, 1999, 77, 9, 1508-1513, https://doi.org/10.1139/cjc-77-9-1508
. [all data]
Alekseev, Kizaev, et al., 1989
Alekseev, V.G.; Kizaev, V.D.; Fedyainov, N.V.; Bushinskii, V.I.,
Standard enthalpies of anhydridisation of phthalic and pyromellitic acids,
Russ. J. Phys. Chem. (Engl. Transl.), 1989, 63, 1280-1282. [all data]
Escalona-Arranz, Perez-Roses, et al., 2010
Escalona-Arranz, J.C.; Perez-Roses, R.; Jimenez, I.L.; Rodriguez-Amado, J.; Argota-Coello, H.; Canizares-Lay, J.; Morris-Quevedo, H.J.; Sierra-Gonzales, G.,
Chemical constituents of Tamarindus indica L. leaves,
Rev. Cubana Quim., 2010, 22, 3, 65-71. [all data]
Pedersen, Durant, et al., 2005
Pedersen, D.U.; Durant, J.L.; Taghizadeh, K.; Hemond, H.F.; Lafleur, A.L.; Cass, G.R.,
Human cell mutagenes in respirable airborne particles from the Northeastern United States. 2. Quantification of mutagenes and other organic compounds.,
Environ. Sci. Technol., 2005, 39, 24, 9547-9560, https://doi.org/10.1021/es050886c
. [all data]