Picric acid
- Formula: C6H3N3O7
- Molecular weight: 229.1039
- IUPAC Standard InChIKey: OXNIZHLAWKMVMX-UHFFFAOYSA-N
- CAS Registry Number: 88-89-1
- Chemical structure:
View 3d structure (requires JavaScript / HTML 5) - Other names: Phenol, 2,4,6-trinitro-; C.I. 10305; Carbazotic Acid; Melinite; Nitroxanthic acid; Picral; Picronitric acid; Trinitrophenol; 2,4,6-Trinitrophenol; Acide picrique; Acido picrico; Phenol trinitrate; Pikrinezuur; Pikrinsaeure; Pikrynowy kwas; 1,3,5-Trinitrophenol; 2-Hydroxy-1,3,5-trinitrobenzene; 2,4,6-Trinitrofenol; 2,4,6-Trinitrofenolo; Kyselina pikrova; UN 0154; 2,4,6-Trinitrophenyl; Hager's reagent; Pertite; Reflorit; NSC 36947

Phase change data

Data compiled as indicated in comments:
TRC - Thermodynamics Research Center, NIST Boulder Laboratories, Chris Muzny director
AC - William E. Acree, Jr., James S. Chickos
DH - Eugene S. Domalski and Elizabeth D. Hearing
Quantity | Value | Units | Method | Reference | Comment |
---|---|---|---|---|---|
Tfus | 395. ± 1. | K | AVG | N/A | Average of 6 values; Individual data points |
Quantity | Value | Units | Method | Reference | Comment |
ΔsubH° | 105.1 ± 1.6 | kJ/mol | ME | Cundall, Frank Palmer, et al., 1978 | Based on data from 314. to 406. K.; AC |
Enthalpy of vaporization
ΔvapH (kJ/mol) | Temperature (K) | Method | Reference | Comment |
---|---|---|---|---|
106.4 | 483. | A | Stephenson and Malanowski, 1987 | The value of 106.4 kJ/mole from Stephenson and Malanowski, 1987 is likely an enthalpy of sublimation; AC |
Enthalpy of fusion
ΔfusH (kJ/mol) | Temperature (K) | Reference | Comment |
---|---|---|---|
17.100 | 394.1 | Farrell, Shahidi, et al., 1979 | DH |
17.1 | 394.1 | Domalski and Hearing, 1996 | AC |
Entropy of fusion
ΔfusS (J/mol*K) | Temperature (K) | Reference | Comment |
---|---|---|---|
43.4 | 394.1 | Farrell, Shahidi, et al., 1979 | DH |

Reaction thermochemistry data

Data compiled by: John E. Bartmess
Individual Reactions
C6H2N3O7- + =
By formula: C6H2N3O7- + H+ = C6H3N3O7
Quantity | Value | Units | Method | Reference | Comment |
---|---|---|---|---|---|
ΔrH° | 1298. ± 9.2 | kJ/mol | G+TS | Koppel, Taft, et al., 1994 | gas phase; Per Leito, Raamat, et al., 2009, dGacid is likely too weak by up to 1.3 kcal/mol. |
Quantity | Value | Units | Method | Reference | Comment |
ΔrG° | 1267. ± 8.4 | kJ/mol | IMRE | Koppel, Taft, et al., 1994 | gas phase; Per Leito, Raamat, et al., 2009, dGacid is likely too weak by up to 1.3 kcal/mol. |
ΔrG° | <1292.9 | kJ/mol | IMRB | Dzidic, Carroll, et al., 1974 | gas phase; I- deprotonates |

Gas phase ion energetics data

Data compiled by: John E. Bartmess
De-protonation reactions
C6H2N3O7- + =
By formula: C6H2N3O7- + H+ = C6H3N3O7
Quantity | Value | Units | Method | Reference | Comment |
---|---|---|---|---|---|
ΔrH° | 1298. ± 9.2 | kJ/mol | G+TS | Koppel, Taft, et al., 1994 | gas phase; Per Leito, Raamat, et al., 2009, dGacid is likely too weak by up to 1.3 kcal/mol. |
Quantity | Value | Units | Method | Reference | Comment |
ΔrG° | 1267. ± 8.4 | kJ/mol | IMRE | Koppel, Taft, et al., 1994 | gas phase; Per Leito, Raamat, et al., 2009, dGacid is likely too weak by up to 1.3 kcal/mol. |
ΔrG° | <1292.9 | kJ/mol | IMRB | Dzidic, Carroll, et al., 1974 | gas phase; I- deprotonates |

References

Cundall, Frank Palmer, et al., 1978
Cundall, Robert B.; Frank Palmer, T.; Wood, Colin E.C.,
Vapour pressure measurements on some organic high explosives,
J. Chem. Soc., Faraday Trans. 1, 1978, 74, 0, 1339, https://doi.org/10.1039/f19787401339
. [all data]
Stephenson and Malanowski, 1987
Stephenson, Richard M.; Malanowski, Stanislaw,
Handbook of the Thermodynamics of Organic Compounds, 1987, https://doi.org/10.1007/978-94-009-3173-2
. [all data]
Farrell, Shahidi, et al., 1979
Farrell, P.G.; Shahidi, F.; Casellato, F.; Vecchi, C.; Girelli, A.,
DSC studies of aromatic hydrocarbon picrates,
Thermochim. Acta, 1979, 33, 275-280. [all data]
Domalski and Hearing, 1996
Domalski, Eugene S.; Hearing, Elizabeth D.,
Heat Capacities and Entropies of Organic Compounds in the Condensed Phase. Volume III,
J. Phys. Chem. Ref. Data, 1996, 25, 1, 1, https://doi.org/10.1063/1.555985
. [all data]
Koppel, Taft, et al., 1994
Koppel, I.A.; Taft, R.W.; Anvia, F.; Zhu, S.Z.; Hu, L.Q.; Sung, K.S.; Desmarteau, D.D.; Yagupolskii, L.M.,
The Gas-Phase Acidities of Very Strong Neutral Bronsted Acids,
J. Am. Chem. Soc., 1994, 116, 7, 3047, https://doi.org/10.1021/ja00086a038
. [all data]
Leito, Raamat, et al., 2009
Leito, I.; Raamat, E.; Kutt, A.; Saame, J.; Kipper, K.; Koppel, I.A.; Koppel, I.; Zhang, M.; Mishima, M.; Yagupolskii, L.M.; Garlyauskayte, R.Y.; Filatov, A.A.,
Revision of the Gas-Phase Acidity Scale below 300 kcal mol(-1),
J. Phys. Chem. A, 2009, 113, 29, 8421-8424, https://doi.org/10.1021/jp903780k
. [all data]
Dzidic, Carroll, et al., 1974
Dzidic, I.; Carroll, D.I.; Stillwell, R.N.; Horning, E.C.,
Gas phase reactions. Ionization by proton transfer to superoxide anions,
J. Am. Chem. Soc., 1974, 96, 5258. [all data]