Benzene, 2-chloro-1,3,5-trinitro-
- Formula: C6H2ClN3O6
- Molecular weight: 247.550
- IUPAC Standard InChIKey: HJRJRUMKQCMYDL-UHFFFAOYSA-N
- CAS Registry Number: 88-88-0
- Chemical structure:
View 3d structure (requires JavaScript / HTML 5) - Other names: Picryl chloride; 1-Chloro-2,4,6-trinitrobenzene; 2-Chloro-1,3,5-trinitrobenzene; 2,4,6-Trinitro-1-chlorobenzene; 2,4,6-Trinitrochlorobenzene; Tncb

Condensed phase thermochemistry data

Data compiled by: Hussein Y. Afeefy, Joel F. Liebman, and Stephen E. Stein
Quantity | Value | Units | Method | Reference | Comment |
---|---|---|---|---|---|
ΔfH°solid | 20.8 | kJ/mol | Ccb | Rinkenbach, 1930 | Author hf298_condensed[kcal/mol]=8.40 |
Quantity | Value | Units | Method | Reference | Comment |
ΔcH°solid | -2691.16 | kJ/mol | Ccb | Rinkenbach, 1930 | Author hf298_condensed[kcal/mol]=8.40 |

Phase change data

Data compiled by: William E. Acree, Jr., James S. Chickos
Enthalpy of vaporization
ΔvapH (kJ/mol) | Temperature (K) | Method | Reference | Comment |
---|---|---|---|---|
63.1 | 488. | A | Stephenson and Malanowski, 1987 | Based on data from 473. to 543. K. See also Maksimov, 1968. |

References

Rinkenbach, 1930
Rinkenbach, W.H.,
The heats of combustion and formation of aromatic nitro compounds,
J. Am. Chem. Soc., 1930, 52, 115-120. [all data]
Stephenson and Malanowski, 1987
Stephenson, Richard M.; Malanowski, Stanislaw,
Handbook of the Thermodynamics of Organic Compounds, 1987, https://doi.org/10.1007/978-94-009-3173-2
. [all data]
Maksimov, 1968
Maksimov, Y.Y.,
Russ. J. Phys. Chem., 1968, 42, 11, 1550. [all data]