o-Nitroaniline
- Formula: C6H6N2O2
- Molecular weight: 138.1240
- IUPAC Standard InChIKey: DPJCXCZTLWNFOH-UHFFFAOYSA-N
- CAS Registry Number: 88-74-4
- Chemical structure:
View 3d structure (requires JavaScript / HTML 5) - Other names: Benzenamine, 2-nitro-; Aniline, o-nitro-; o-Aminonitrobenzene; Azoene Fast Orange GR Base; Azoene Fast Orange GR Salt; Azofix Orange GR Salt; Azogene Fast Orange GR; Brentamine Fast Orange GR Base; Brentamine Fast Orange GR Salt; C.I. Azoic Diazo Component 6; C.I. 37025; Devol Orange B; Devol Orange Salt B; Diazo Fast Orange GR; Fast Orange Base JR; Fast Orange GR Base; Fast Orange GR Salt; Fast Orange O Base; Fast Orange O Salt; Fast Orange Salt JR; Hiltonil Fast Orange GR Base; Hiltosal Fast Orange GR Salt; Hindasol Orange GR Salt; Natasol Fast Orange GR Salt; Orange Base Ciba II; Orange Base Irga II; Orange GRS Salt; Orange Salt Ciba II; Orange Salt Irga II; ONA; 1-Amino-2-Nitrobenzene; 2-Aminonitrobenzene; 2-Nitroaniline; 2-Nitrobenzenamine; 2-Nitro-benzeneamine; o-Nitraniline; Azoic Diazo Component 6; Fast Orange Base GR; Fast Orange Salt GR; Orthonitroaniline; 1-Nitro-2-aminobenzene; o-Nitranilin; NSC 9796

Phase change data

Data compiled as indicated in comments:
BS - Robert L. Brown and Stephen E. Stein
TRC - Thermodynamics Research Center, NIST Boulder Laboratories, Chris Muzny director
AC - William E. Acree, Jr., James S. Chickos
ALS - Hussein Y. Afeefy, Joel F. Liebman, and Stephen E. Stein
DH - Eugene S. Domalski and Elizabeth D. Hearing
Quantity | Value | Units | Method | Reference | Comment |
---|---|---|---|---|---|
Tboil | 557.2 | K | N/A | Weast and Grasselli, 1989 | BS |
Quantity | Value | Units | Method | Reference | Comment |
Tfus | 344. ± 2. | K | AVG | N/A | Average of 7 values; Individual data points |
Quantity | Value | Units | Method | Reference | Comment |
ΔsubH° | 21.3 ± 0.2 | kcal/mol | GS | Verevkin, 1997 | Based on data from 313. to 342. K.; AC |
Enthalpy of vaporization
ΔvapH (kcal/mol) | Temperature (K) | Method | Reference | Comment |
---|---|---|---|---|
14.2 | 438. | A | Stephenson and Malanowski, 1987 | Based on data from 423. to 553. K.; AC |
15.5 | 392. | N/A | Stull, 1947 | Based on data from 377. to 558. K.; AC |
Antoine Equation Parameters
log10(P) = A − (B / (T + C))
P = vapor pressure (atm)
T = temperature (K)
View plot Requires a JavaScript / HTML 5 canvas capable browser.
Temperature (K) | A | B | C | Reference | Comment |
---|---|---|---|---|---|
377. to 557.7 | 5.68583 | 3067.427 | -18.865 | Stull, 1947 | Coefficents calculated by NIST from author's data. |
Enthalpy of sublimation
ΔsubH (kcal/mol) | Temperature (K) | Method | Reference | Comment |
---|---|---|---|---|
20.8 ± 0.2 | 328. | GS | Verevkin, 1997 | Based on data from 313. to 342. K.; AC |
21.5 ± 1.0 | 223. | V | Hoyer and Peperle, 1958 | Reanalyzed by Pedley, Naylor, et al., 1986, Original value = 20.9 kcal/mol; ALS |
19.7 ± 0.5 | 313. | N/A | Wolf and Weghofer, 1938 | See also Jones, 1960 and Trieschmann, 1935.; AC |
19.7 ± 0.4 | 313. | V | Wolf and Weghofer, 1938, 2 | ALS |
19.1 ± 0.41 | 310. to 319. | N/A | Wolf and Trieschmann, 1934 | AC |
Enthalpy of fusion
ΔfusH (kcal/mol) | Temperature (K) | Reference | Comment |
---|---|---|---|
3.850 | 344.4 | Domalski and Hearing, 1996 | AC |
3.8504 | 342.5 | Andrews, Lynn, et al., 1926 | DH |
Entropy of fusion
ΔfusS (cal/mol*K) | Temperature (K) | Reference | Comment |
---|---|---|---|
11.2 | 342.5 | Andrews, Lynn, et al., 1926 | DH |

Gas phase ion energetics data

Data compiled as indicated in comments:
LLK - Sharon G. Lias, Rhoda D. Levin, and Sherif A. Kafafi
RDSH - Henry M. Rosenstock, Keith Draxl, Bruce W. Steiner, and John T. Herron

Ionization energy determinations

IE (eV) Method Reference Comment
8.27 ± 0.01PIPotapov, Kardash, et al., 1972LLK
8.66EICrable and Kearns, 1962RDSH
8.43PEKhalil, Meeks, et al., 1973Vertical value; LLK

Lee's RI, non-polar column, temperature ramp

Data compiled by: NIST Mass Spectrometry Data Center, William E. Wallace, director

Column type Capillary
Active phase DB-5
Column length (m) 30.
Carrier gas He
Substrate
Column diameter (mm) 0.32
Phase thickness (μm) 0.25
Tstart (C) 40.
Tend (C) 285.
Heat rate (K/min) 8.
Initial hold (min) 3.
Final hold (min) 29.5
I 241.1
ReferenceDonnelly, Abdel-Hamid, et al., 1993
Comment MSDC-RI

References

Weast and Grasselli, 1989
CRC Handbook of Data on Organic Compounds, 2nd Editon, Weast,R.C and Grasselli, J.G., ed(s)., CRC Press, Inc., Boca Raton, FL, 1989, 1. [all data]
Verevkin, 1997
Verevkin, Sergey P.,
Thermochemistry of nitro compounds. Experimental standard enthalpies of formation and improved group-additivity values,
Thermochimica Acta, 1997, 307, 1, 17-25, https://doi.org/10.1016/S0040-6031(97)00359-6
. [all data]
Stephenson and Malanowski, 1987
Stephenson, Richard M.; Malanowski, Stanislaw,
Handbook of the Thermodynamics of Organic Compounds, 1987, https://doi.org/10.1007/978-94-009-3173-2
. [all data]
Stull, 1947
Stull, Daniel R.,
Vapor Pressure of Pure Substances. Organic and Inorganic Compounds,
Ind. Eng. Chem., 1947, 39, 4, 517-540, https://doi.org/10.1021/ie50448a022
. [all data]
Hoyer and Peperle, 1958
Hoyer, H.; Peperle, W.,
Dampfdrunkmessungen an organischen substanzen und ihre sublimationswarmen,
Z. Electrochem., 1958, 62, 61-66. [all data]
Pedley, Naylor, et al., 1986
Pedley, J.B.; Naylor, R.D.; Kirby, S.P.,
Thermochemical Data of Organic Compounds, Chapman and Hall, New York, 1986, 1-792. [all data]
Wolf and Weghofer, 1938
Wolf, K.L.; Weghofer, H.Z.,
Z. Phys. Chem. Abt. B, 1938, 39, 194. [all data]
Jones, 1960
Jones, A.H.,
Sublimation Pressure Data for Organic Compounds.,
J. Chem. Eng. Data, 1960, 5, 2, 196-200, https://doi.org/10.1021/je60006a019
. [all data]
Trieschmann, 1935
Trieschmann, H.G.,
, Ph.D. Dissertation, Inst. Fur Phys. Chem. and Electrochem. der Universitat Kiel, Germany, 1935. [all data]
Wolf and Weghofer, 1938, 2
Wolf, K.L.; Weghofer, H.,
Uber sublimationswarmen,
Z. Phys. Chem., 1938, 39, 194-208. [all data]
Wolf and Trieschmann, 1934
Wolf, K.L.; Trieschmann, H.G.,
Z. Phys. Chem. Abt. B, 1934, 27, 376. [all data]
Domalski and Hearing, 1996
Domalski, Eugene S.; Hearing, Elizabeth D.,
Heat Capacities and Entropies of Organic Compounds in the Condensed Phase. Volume III,
J. Phys. Chem. Ref. Data, 1996, 25, 1, 1, https://doi.org/10.1063/1.555985
. [all data]
Andrews, Lynn, et al., 1926
Andrews, D.H.; Lynn, G.; Johnston, J.,
The heat capacities and heat of crystallization of some isomeric aromatic compounds,
J. Am. Chem. Soc., 1926, 48, 1274-1287. [all data]