Benzene, 1-chloro-2-nitro-
- Formula: C6H4ClNO2
- Molecular weight: 157.554
- IUPAC Standard InChIKey: BFCFYVKQTRLZHA-UHFFFAOYSA-N
- CAS Registry Number: 88-73-3
- Chemical structure:
View 3d structure (requires JavaScript / HTML 5) - Other names: o-Chloronitrobenzene; o-Nitrochlorobenzene; ONCB; 1-Chloro-2-Nitrobenzene; 2-Chloronitrobenzene; 2-Nitrochlorobenzene; 2-Chloro-1-nitrobenzene; Chloro-o-nitrobenzene; Nitrochlorobenzene, o-; Nitrochlorobenzene, ortho; 1-Nitro-2-chlorobenzene; 2-Nitro-1-chlorobenzene; NSC 36934

Condensed phase thermochemistry data

Data compiled by: Hussein Y. Afeefy, Joel F. Liebman, and Stephen E. Stein
Quantity | Value | Units | Method | Reference | Comment |
---|---|---|---|---|---|
ΔfH°solid | -32.9 | kJ/mol | Ccb | Masalitinova, Oleinikova, et al., 1981 | |
Quantity | Value | Units | Method | Reference | Comment |
ΔcH°solid | -2923.3 ± 2.5 | kJ/mol | Ccb | Masalitinova, Oleinikova, et al., 1981 |

Phase change data

Data compiled as indicated in comments:
BS - Robert L. Brown and Stephen E. Stein
TRC - Thermodynamics Research Center, NIST Boulder Laboratories, Chris Muzny director
AC - William E. Acree, Jr., James S. Chickos
Quantity | Value | Units | Method | Reference | Comment |
---|---|---|---|---|---|
Tboil | 519.2 | K | N/A | Weast and Grasselli, 1989 | BS |
Tboil | 519.15 | K | N/A | Lecat, 1947 | Uncertainty assigned by TRC = 0.6 K; TRC |
Quantity | Value | Units | Method | Reference | Comment |
Tfus | 305.28 | K | N/A | Witschonke, 1954 | Uncertainty assigned by TRC = 0.07 K; TRC |
Tfus | 305.28 | K | N/A | Witschonke, 1954 | Uncertainty assigned by TRC = 0.05 K; TRC |
Tfus | 306. | K | N/A | Timmermans, 1935 | Uncertainty assigned by TRC = 1.5 K; TRC |
Tfus | 305.15 | K | N/A | Cauwood and Turner, 1915 | Uncertainty assigned by TRC = 0.15 K; TRC |
Tfus | 305.7 | K | N/A | Buechner, 1906 | Uncertainty assigned by TRC = 1.5 K; TRC |
Quantity | Value | Units | Method | Reference | Comment |
ΔvapH° | 60.4 ± 0.3 | kJ/mol | GS | Verevkin and Schick, 2003 | Based on data from 307. to 334. K.; AC |
Quantity | Value | Units | Method | Reference | Comment |
ΔsubH° | 80.9 ± 1.5 | kJ/mol | C | Ribeiro da Silva, Lobo Ferreira, et al., 2009 | AC |
ΔsubH° | 80.8 ± 0.3 | kJ/mol | GS | Verevkin and Schick, 2003 | Based on data from 278. to 305. K.; AC |
Reduced pressure boiling point
Tboil (K) | Pressure (bar) | Reference | Comment |
---|---|---|---|
392.2 | 0.01 | Weast and Grasselli, 1989 | BS |
Enthalpy of vaporization
ΔvapH (kJ/mol) | Temperature (K) | Method | Reference | Comment |
---|---|---|---|---|
52.1 | 435. | EB | Putcha, Ivaturi, et al., 1984 | Based on data from 420. to 516. K.; AC |
Enthalpy of fusion
ΔfusH (kJ/mol) | Temperature (K) | Reference | Comment |
---|---|---|---|
18.11 | 305.8 | Straka, Ruzicka, et al., 2007 | AC |
18.21 | 305.8 | Verevkin and Schick, 2003 | AC |
19.08 | 308.2 | Masalitinova, Oleinikova, et al., 1981, 2 | AC |

Reaction thermochemistry data

Data compiled as indicated in comments:
B - John E. Bartmess
M - Michael M. Meot-Ner (Mautner) and Sharon G. Lias
Individual Reactions
By formula: Br- + C6H4ClNO2 = (Br- • C6H4ClNO2)
Quantity | Value | Units | Method | Reference | Comment |
---|---|---|---|---|---|
ΔrH° | 71.5 ± 7.5 | kJ/mol | IMRE | Paul and Kebarle, 1991 | gas phase; ΔGaff at 423 K, ΔSaff taken as that of mCF3-nitrobenzene..Br-; B,M |
Quantity | Value | Units | Method | Reference | Comment |
ΔrS° | 92. | J/mol*K | N/A | Paul and Kebarle, 1991 | gas phase; Entropy change calculated or estimated; M |
Quantity | Value | Units | Method | Reference | Comment |
ΔrG° | 32. ± 4.2 | kJ/mol | IMRE | Paul and Kebarle, 1991 | gas phase; ΔGaff at 423 K, ΔSaff taken as that of mCF3-nitrobenzene..Br-; B |
Free energy of reaction
ΔrG° (kJ/mol) | T (K) | Method | Reference | Comment |
---|---|---|---|---|
32. | 423. | PHPMS | Paul and Kebarle, 1991 | gas phase; Entropy change calculated or estimated; M |

Gas phase ion energetics data

Data compiled by: John E. Bartmess
Electron affinity determinations
EA (eV) | Method | Reference | Comment |
---|---|---|---|
1.16 ± 0.10 | IMRE | Chowdhury, Heinis, et al., 1986 | ΔGea(423 K) = -25.7 kcal/mol; ΔSea (estimated) = -1.6 eu. |
1.114 ± 0.048 | IMRE | Fukuda and McIver, 1985 | ΔGea(355 K) = -25.1 kcal/mol; ΔSea =-1.6, est. from data in Chowdhury, Heinis, et al., 1986 |
<1.340 ± 0.050 | PD | Mock and Grimsrud, 1989 |

Ion clustering data

Data compiled as indicated in comments:
B - John E. Bartmess
M - Michael M. Meot-Ner (Mautner) and Sharon G. Lias
Clustering reactions
By formula: Br- + C6H4ClNO2 = (Br- • C6H4ClNO2)
Quantity | Value | Units | Method | Reference | Comment |
---|---|---|---|---|---|
ΔrH° | 71.5 ± 7.5 | kJ/mol | IMRE | Paul and Kebarle, 1991 | gas phase; ΔGaff at 423 K, ΔSaff taken as that of mCF3-nitrobenzene..Br-; B,M |
Quantity | Value | Units | Method | Reference | Comment |
ΔrS° | 92. | J/mol*K | N/A | Paul and Kebarle, 1991 | gas phase; Entropy change calculated or estimated; M |
Quantity | Value | Units | Method | Reference | Comment |
ΔrG° | 32. ± 4.2 | kJ/mol | IMRE | Paul and Kebarle, 1991 | gas phase; ΔGaff at 423 K, ΔSaff taken as that of mCF3-nitrobenzene..Br-; B |
Free energy of reaction
ΔrG° (kJ/mol) | T (K) | Method | Reference | Comment |
---|---|---|---|---|
32. | 423. | PHPMS | Paul and Kebarle, 1991 | gas phase; Entropy change calculated or estimated; M |

Van Den Dool and Kratz RI, non-polar column, custom temperature program

Column type | Active phase | I | Reference | Comment |
---|---|---|---|---|
Capillary | 5 % Phenyl methyl siloxane | 1241. | Yasuhara, Shiraishi, et al., 1997 | 25. m/0.31 mm/0.52 μm, He; Program: 50C(2min) => (20C/min) => 120C => (7C/min) => 310C(10min) |

Normal alkane RI, non-polar column, temperature ramp

Column type | Active phase | I | Reference | Comment |
---|---|---|---|---|
Capillary | Ultra-1 | 1195. | Okumura, 1991 | 25. m/0.32 mm/0.25 μm, He, 3. K/min; Tstart: 80. C; Tend: 260. C |

Normal alkane RI, non-polar column, custom temperature program

Column type | Active phase | I | Reference | Comment |
---|---|---|---|---|
Capillary | SPB-1 | 1193. | Vezzani, Moretti, et al., 1994 | Column length: 30. m; Column diameter: 0.32 mm; Program: not specified |
Capillary | OV-1 | 1199. | Waggott and Davies, 1984 | Hydrogen; Column length: 50. m; Column diameter: 0.32 mm; Program: not specified |

Normal alkane RI, polar column, custom temperature program

Column type | Active phase | I | Reference | Comment |
---|---|---|---|---|
Capillary | Superox 0.6; Carbowax 20M | 1946. | Waggott and Davies, 1984 | Hydrogen; Column length: 50. m; Column diameter: 0.32 mm; Program: not specified |
Capillary | Superox 0.6; Carbowax 20M | 1964. | Waggott and Davies, 1984 | Hydrogen; Column length: 50. m; Column diameter: 0.32 mm; Program: not specified |
Capillary | Carbowax 400, Carbowax 20M, Carbowax 1540, Carbowax 4000, Superox 06, PEG 20M, etc. | 1946. | Waggott and Davies, 1984 | Hydrogen; Column length: 50. m; Column diameter: 0.32 mm; Program: not specified |

Lee's RI, non-polar column, temperature ramp

Column type | Active phase | I | Reference | Comment |
---|---|---|---|---|
Capillary | HP5-MS | 213. | Vrana, Paschke, et al., 2005 | 30. m/0.25 mm/0.25 μm, Helium, 50. C @ 5. min, 5. K/min, 280. C @ 10. min |

References

Masalitinova, Oleinikova, et al., 1981
Masalitinova, T.N.; Oleinikova, T.P.; Ryadnenko, V.L.; Kiseleva, N.N.; Lebedeva, N.D.,
Thermal effects of the hydrogenation of chloronitrobenzenes,
J. Appl. Chem. USSR, 1981, 54, 1551-1554, In original 1799. [all data]
Weast and Grasselli, 1989
CRC Handbook of Data on Organic Compounds, 2nd Editon, Weast,R.C and Grasselli, J.G., ed(s)., CRC Press, Inc., Boca Raton, FL, 1989, 1. [all data]
Lecat, 1947
Lecat, M.,
Some azeotropes of which one constituant is heterocyclic nitrogen,
Ann. Soc. Sci. Bruxelles, Ser. 1, 1947, 61, 73. [all data]
Witschonke, 1954
Witschonke, C.R.,
Freezing point and purity data for some organic compounds,
Anal. Chem., 1954, 26, 562-4. [all data]
Timmermans, 1935
Timmermans, J.,
Researches in Stoichiometry. I. The Heat of Fusion of Organic Compounds.,
Bull. Soc. Chim. Belg., 1935, 44, 17-40. [all data]
Cauwood and Turner, 1915
Cauwood, J.D.; Turner, W.E.S.,
XXXI. The Dielectric Constants of Some Organic Solvents at their Melting or Boiling Points,
J. Chem. Soc., Trans., 1915, 107, 276. [all data]
Buechner, 1906
Buechner, E.H.,
Z. Phys. Chem., Stoechiom. Verwandtschaftsl., 1906, 54, 665. [all data]
Verevkin and Schick, 2003
Verevkin, Sergey P.; Schick, Christoph,
Determination of vapor pressures, enthalpies of sublimation, enthalpies of vaporization, and enthalpies of fusion of a series of chloro-aminobenzenes and chloro-nitrobenzenes,
Fluid Phase Equilibria, 2003, 211, 2, 161-177, https://doi.org/10.1016/S0378-3812(03)00181-X
. [all data]
Ribeiro da Silva, Lobo Ferreira, et al., 2009
Ribeiro da Silva, Manuel A.V.; Lobo Ferreira, Ana I.M.C.; Moreno, Ana Rita G.,
Experimental thermochemical study of the monochloronitrobenzene isomers,
The Journal of Chemical Thermodynamics, 2009, 41, 1, 109-114, https://doi.org/10.1016/j.jct.2008.07.012
. [all data]
Putcha, Ivaturi, et al., 1984
Putcha, Sivaram; Ivaturi, Rao V.; Machiraju, Ramakrishna,
Vapor pressures of o-and m-nitrochlorobenzene,
J. Chem. Eng. Data, 1984, 29, 2, 135-136, https://doi.org/10.1021/je00036a011
. [all data]
Straka, Ruzicka, et al., 2007
Straka, Martin; Ruzicka, Kvetoslav; Ruzicka, Vlastimil,
Heat Capacities of Chloroanilines and Chloronitrobenzenes,
J. Chem. Eng. Data, 2007, 52, 4, 1375-1380, https://doi.org/10.1021/je700080k
. [all data]
Masalitinova, Oleinikova, et al., 1981, 2
Masalitinova, T.N.; Oleinikova, T.P.; Ryadnenko, V.L.; Kiseleva, N.N.; Lebedeva, N.D.,
Zh. Prikl. Khim. (Leningrad), 1981, 54, 1799. [all data]
Paul and Kebarle, 1991
Paul, G.J.C.; Kebarle, P.,
Stabilities of Complexes of Br- with Substituted Benzenes (SB) Based on Determinations of the Gas-Phase Equilibria Br- + SB = (BrSB)-,
J. Am. Chem. Soc., 1991, 113, 4, 1148, https://doi.org/10.1021/ja00004a014
. [all data]
Chowdhury, Heinis, et al., 1986
Chowdhury, S.; Heinis, T.; Grimsrud, E.P.; Kebarle, P.,
Entropy Changes and Electron Affinities from Gas-Phase Electron Transfer Equilibria: A- + B = A + B-,
J. Phys. Chem., 1986, 90, 12, 2747, https://doi.org/10.1021/j100403a037
. [all data]
Fukuda and McIver, 1985
Fukuda, E.K.; McIver, R.T., Jr.,
Relative electron affinities of substituted benzophenones, nitrobenzenes, and quinones. [Anchored to EA(SO2) from 74CEL/BEN],
J. Am. Chem. Soc., 1985, 107, 2291. [all data]
Mock and Grimsrud, 1989
Mock, R.S.; Grimsrud, E.P.,
Gas-Phase Electron Photodetachment Spectroscopy of the Molecular Anions of Nitroaromatic Hydrocarbons at Atmospheric Pressure,
J. Am. Chem. Soc., 1989, 111, 8, 2861, https://doi.org/10.1021/ja00190a020
. [all data]
Yasuhara, Shiraishi, et al., 1997
Yasuhara, A.; Shiraishi, H.; Nishikawa, M.; Yamamoto, T.; Uehiro, T.; Nakasugi, O.; Okumura, T.; Kenmotsu, K.; Fukui, H.; Nagase, M.; Ono, Y.; Kawagoshi, Y.; Baba, K.; Noma, Y.,
Determination of organic components in leachates from hazardous waste disposal sites in Japan by gas chromatography-mass spectrometry,
J. Chromatogr. A, 1997, 774, 1-2, 321-332, https://doi.org/10.1016/S0021-9673(97)00078-2
. [all data]
Okumura, 1991
Okumura, T.,
retention indices of environmental chemicals on methyl silicone capillary column,
Journal of Environmental Chemistry (Japan), 1991, 1, 2, 333-358, https://doi.org/10.5985/jec.1.333
. [all data]
Vezzani, Moretti, et al., 1994
Vezzani, S.; Moretti, P.; Castello, G.,
Fast and Accurate Method for the Automatic Prediction of Programmed-Temperature Retention Times,
J. Chromatogr. A, 1994, 677, 2, 331-343, https://doi.org/10.1016/0021-9673(94)80161-4
. [all data]
Waggott and Davies, 1984
Waggott, A.; Davies, I.W.,
Identification of organic pollutants using linear temperature programmed retention indices (LTPRIs) - Part II, 1984, retrieved from http://dwi.defra.gov.uk/research/completed-research/reports/dwi0383.pdf. [all data]
Vrana, Paschke, et al., 2005
Vrana, B.; Paschke, H.; Paschke, A.; Popp, P.; Schuurmann, G.,
Performance of semipermeable membrane devices for sampling of organic contaminants in groun water,
J. Envirom. Monit., 2005, 7, 5, 500-508, https://doi.org/10.1039/b411645c
. [all data]